dl-Cysteine
- Formula: C3H7NO2S
- Molecular weight: 121.158
- IUPAC Standard InChIKey: XUJNEKJLAYXESH-UHFFFAOYSA-N
- CAS Registry Number: 3374-22-9
- Chemical structure:
View 3d structure (requires JavaScript / HTML 5) - Stereoisomers:
- Other names: L-HSCH2CH(NH2)COOH; Cysteine, DL-

Reaction thermochemistry data

Data compiled by: Robert C. Dunbar
Individual Reactions
By formula: Na+ + C3H7NO2S = (Na+ • C3H7NO2S)
Quantity | Value | Units | Method | Reference | Comment |
---|---|---|---|---|---|
ΔrH° | 179. ± 13. | kJ/mol | IMRE | Gapeev and Dunbar, 2003 | Anchor glycine=38.5+-2.2 |
ΔrH° | 175. | kJ/mol | CIDC | Kish, Ohanessian, et al., 2003 | Anchor alanine=39.89 |

Gas phase ion energetics data

Data compiled as indicated in comments:
LBLHLM - Sharon G. Lias, John E. Bartmess, Joel F. Liebman, John L. Holmes, Rhoda D. Levin, and W. Gary Mallard
RDSH - Henry M. Rosenstock, Keith Draxl, Bruce W. Steiner, and John T. Herron
Ionization energy determinations
IE (eV) | Method | Reference | Comment |
---|---|---|---|
9.5 | PE | Cannington and Ham, 1983 | LBLHLM |
~9. | PI | Akopyan and Loginov, 1967 | RDSH |

Ion clustering data

Data compiled by: Robert C. Dunbar
Clustering reactions
By formula: Na+ + C3H7NO2S = (Na+ • C3H7NO2S)
Quantity | Value | Units | Method | Reference | Comment |
---|---|---|---|---|---|
ΔrH° | 179. ± 13. | kJ/mol | IMRE | Gapeev and Dunbar, 2003 | Anchor glycine=38.5+-2.2 |
ΔrH° | 175. | kJ/mol | CIDC | Kish, Ohanessian, et al., 2003 | Anchor alanine=39.89 |

References

Gapeev and Dunbar, 2003
Gapeev, A.; Dunbar, R.C.,
Na+ Affinities of Gas-Phase Amino Acids by Ligand Exchange Equilibrium,
Int. J. Mass Spectrom., 2003, 228, 2-3, 825, https://doi.org/10.1016/S1387-3806(03)00242-2
. [all data]
Kish, Ohanessian, et al., 2003
Kish, M.M.; Ohanessian, G.; Wesdemiotis, C.,
The Na+ affinities of a-amino acids: side-chain substituent effects,
Int. J. Mass Spectrom., 2003, 227, 3, 509, https://doi.org/10.1016/S1387-3806(03)00082-4
. [all data]
Cannington and Ham, 1983
Cannington, P.H.; Ham, N.S.,
He(I) and He(II) photoelectron spectra of glycine and related molecules,
J. Electron Spectrosc. Relat. Phenom., 1983, 32, 139. [all data]
Akopyan and Loginov, 1967
Akopyan, M.E.; Loginov, Yy.V.,
Mass-spectrometric study of the phoionization of free α-aminoacids,
High Energy Chem., 1967, 1, 83, In original 97. [all data]