Ethyne, 1-ethenyloxy-
- Formula: C4H4O
- Molecular weight: 68.0740
- IUPAC Standard InChIKey: CXKWXYISKZVUBR-UHFFFAOYSA-N
- CAS Registry Number: 33733-90-3
- Chemical structure:
View 3d structure (requires JavaScript / HTML 5) - Permanent link for this species. Use this link for bookmarking this species for future reference.

Gas phase ion energetics data

Data compiled as indicated in comments:
LBLHLM - Sharon G. Lias, John E. Bartmess, Joel F. Liebman, John L. Holmes, Rhoda D. Levin, and W. Gary Mallard
LLK - Sharon G. Lias, Rhoda D. Levin, and Sherif A. Kafafi
Ionization energy determinations
IE (eV) | Method | Reference | Comment |
---|---|---|---|
9.40 | EI | Burgers, Holmes, et al., 1982 | LBLHLM |
>8.9 | EI | Holmes and Terlouw, 1979 | LLK |
Appearance energy determinations
Ion | AE (eV) | Other Products | Method | Reference | Comment |
---|---|---|---|---|---|
C2H3+ | 11.36 ± 0.05 | HCðCO | EI | Holmes and Lossing, 1984 | LBLHLM |

References

Burgers, Holmes, et al., 1982
Burgers, P.C.; Holmes, J.L.; Lossing, F.P.; Mommers, A.A.; Povel, F.R.; Terlouw, J.K.,
Isomeric and tautomeric [C4H4O]+ ions. Their thermochemistry and collisionally induced fragmentation characteristics,
Can. J. Chem., 1982, 60, 2246. [all data]
Holmes and Terlouw, 1979
Holmes, J.L.; Terlouw, J.K.,
Structures of [C4H4O]+ ions produced from 2- and 4-pyrone,
J. Am. Chem. Soc., 1979, 101, 4973. [all data]
Holmes and Lossing, 1984
Holmes, J.L.; Lossing, F.P.,
Heats of formation of organic radicals from appearance energies,
Int. J. Mass Spectrom. Ion Processes, 1984, 58, 113. [all data]