Phenethyl alcohol,m-methoxy-,acetate
- Formula: C11H14O3
- Molecular weight: 194.2271
- IUPAC Standard InChIKey: GIMOZJDLJUDAIK-UHFFFAOYSA-N
- CAS Registry Number: 33709-39-6
- Chemical structure:
View 3d structure (requires JavaScript / HTML 5) - Permanent link for this species. Use this link for bookmarking this species for future reference.

Gas phase ion energetics data

Data compiled by: Sharon G. Lias, Rhoda D. Levin, and Sherif A. Kafafi
Appearance energy determinations
Ion | AE (eV) | Other Products | Method | Reference | Comment |
---|---|---|---|---|---|
C2H3O+ | 11.80 | ? | EI | Audier, Bouchoux, et al., 1971 | |
C8H9O+ | 12.10 | ? | EI | Audier, Bouchoux, et al., 1971 | |
C9H10O+ | 8.40 | ? | EI | Audier, Bouchoux, et al., 1971 |

References

Audier, Bouchoux, et al., 1971
Audier, H.E.; Bouchoux, G.; Fetizon, M.,
Ionisation et fragmentation en spectrometrie de masse. II. Influence du substituant sur des fragmentations competitives en serie aromatique,
Bull. Soc. Chim. Fr., 1971, 3, 858. [all data]