Benzeneethanol,4-amino-,acetate(ester)
- Formula: C10H13NO2
- Molecular weight: 179.2157
- IUPAC Standard InChIKey: SKILLEHGFMDIJB-UHFFFAOYSA-N
- CAS Registry Number: 33709-38-5
- Chemical structure:
View 3d structure (requires JavaScript / HTML 5) - Permanent link for this species. Use this link for bookmarking this species for future reference.

Gas phase ion energetics data

Data compiled by: Sharon G. Lias, Rhoda D. Levin, and Sherif A. Kafafi
Appearance energy determinations
Ion | AE (eV) | Other Products | Method | Reference | Comment |
---|---|---|---|---|---|
C2H3O+ | 12.30 | ? | EI | Audier, Bouchoux, et al., 1971 | |
C7H8N+ | 11.00 | ? | EI | Audier, Bouchoux, et al., 1971 | |
C8H9N+ | 7.80 | ? | EI | Audier, Bouchoux, et al., 1971 |

References

Audier, Bouchoux, et al., 1971
Audier, H.E.; Bouchoux, G.; Fetizon, M.,
Ionisation et fragmentation en spectrometrie de masse. II. Influence du substituant sur des fragmentations competitives en serie aromatique,
Bull. Soc. Chim. Fr., 1971, 3, 858. [all data]