Tricyclo[3.2.1.02,4]oct-6-ene,8-(1-methylethylidene)-,endo-
- Formula: C11H14
- Molecular weight: 146.2289
- IUPAC Standard InChIKey: PJNTWHFGDZQPOJ-UHFFFAOYSA-N
- CAS Registry Number: 33701-58-5
- Chemical structure:
View 3d structure (requires JavaScript / HTML 5) - Permanent link for this species. Use this link for bookmarking this species for future reference.

Gas phase ion energetics data

Data compiled by: Sharon G. Lias, Rhoda D. Levin, and Sherif A. Kafafi
Ionization energy determinations
IE (eV) | Method | Reference |
---|---|---|
7.9 | PE | Heilbronner and Martin, 1972 |

References

Heilbronner and Martin, 1972
Heilbronner, E.; Martin, H.D.,
The π-orbital sequence in norbornadiene and related hydrocarbons,
Helv. Chim. Acta, 1972, 55, 1490. [all data]