Butanamide,N-(2-chlorophenyl)-
- Formula: C10H12ClNO
- Molecular weight: 197.661
- IUPAC Standard InChIKey: SUINBJHPZPYMTI-UHFFFAOYSA-N
- CAS Registry Number: 33694-15-4
- Chemical structure:
View 3d structure (requires JavaScript / HTML 5) - Other names: 2-Chlorobutylanilide

Gas phase ion energetics data

Data compiled by: Sharon G. Lias, Rhoda D. Levin, and Sherif A. Kafafi
Ionization energy determinations
IE (eV) | Method | Reference |
---|---|---|
8.50 ± 0.05 | EI | Baldwin, Loudon, et al., 1976 |
Appearance energy determinations
Ion | AE (eV) | Other Products | Method | Reference | Comment |
---|---|---|---|---|---|
C6H6NCl+ | 10.70 | ? | EI | Baldwin, Loudon, et al., 1976 | |
C10H12NO+ | 9.45 | Cl | EI | Baldwin, Loudon, et al., 1976 |

References

Baldwin, Loudon, et al., 1976
Baldwin, M.A.; Loudon, A.G.; Maccoll, A.; Webb, K.S.,
The nature and fragmentation pathways of the molecular ions of some arylureas, arylthioureas, acetanilides, thioacetanilides and related compounds,
Org. Mass Spectrom., 1976, 11, 1181. [all data]