Phenol, 3-(2-phenylethyl)-
- Formula: C14H14O
- Molecular weight: 198.2604
- IUPAC Standard InChIKey: AIHZDRMFOVBNAV-UHFFFAOYSA-N
- CAS Registry Number: 33675-75-1
- Chemical structure:
View 3d structure (requires JavaScript / HTML 5) - Other names: Phenol, m-phenethyl-; 1-m-Hydroxyphenyl-2-phenylethane; 3-(2-Phenylethyl)phenol; 1-(3-Hydroxyphenyl)-2-phenylethane

Gas phase ion energetics data

Data compiled by: Henry M. Rosenstock, Keith Draxl, Bruce W. Steiner, and John T. Herron
Ionization energy determinations
IE (eV) | Method | Reference |
---|---|---|
8.3 ± 0.1 | EI | McLafferty, Wachs, et al., 1970 |
Appearance energy determinations
Ion | AE (eV) | Other Products | Method | Reference | Comment |
---|---|---|---|---|---|
C7H7+ | 10.9 ± 0.2 | ? | EI | McLafferty, Wachs, et al., 1970 | |
C7H7O+ | 10.8 ± 0.2 | C7H7 | EI | McLafferty, Wachs, et al., 1970 |

Lee's RI, non-polar column, custom temperature program

View large format table.

Column type Active phase I Reference Comment
CapillaryMethyl Silicone307.33Eckel, Ross, et al., 1993Program: not specified

References

McLafferty, Wachs, et al., 1970
McLafferty, F.W.; Wachs, T.; Lifshitz, C.; Innorta, G.; Irving, P.,
Substituent effects in unimolecular ion decompositions. XV. Mechanistic interpretations and the quasi-equilibrium theory,
J. Am. Chem. Soc., 1970, 92, 6867. [all data]