2-Aminophenanthrene
- Formula: C14H11N
- Molecular weight: 193.2438
- IUPAC Standard InChIKey: ZEAWSFHWVLOENK-UHFFFAOYSA-N
- CAS Registry Number: 3366-65-2
- Chemical structure:
View 3d structure (requires JavaScript / HTML 5) - Other names: 2-Phenanthrenamine; 2-Phenanthrylamine

Gas phase ion energetics data

Data compiled by: Henry M. Rosenstock, Keith Draxl, Bruce W. Steiner, and John T. Herron
Ionization energy determinations
IE (eV) | Method | Reference |
---|---|---|
7.6 ± 0.1 | CTS | Farrell and Newton, 1966 |

Lee's RI, non-polar column, temperature ramp

View large format table.

Column type Active phase I Reference Comment
CapillarySE-52365.80Vassilaros, Kong, et al., 198220. m/0.30 mm/0.25 μm, H2, 40. C @ 2. min, 4. K/min; Tend: 265. C

References

Farrell and Newton, 1966
Farrell, P.G.; Newton, J.,
Ionization potentials of primary aromatic amines and aza-hydrocarbons,
Tetrahedron Lett., 1966, 5517. [all data]