Silane,2,4-cyclopentadien-1-ylidenebis[trimethyl-
- Formula: C11H22Si2
- Molecular weight: 210.4634
- IUPAC Standard InChIKey: WKPCFWUTZIBSRW-UHFFFAOYSA-N
- CAS Registry Number: 33630-76-1
- Chemical structure:
View 3d structure (requires JavaScript / HTML 5) - Permanent link for this species. Use this link for bookmarking this species for future reference.

Gas phase ion energetics data

Data compiled by: Sharon G. Lias, Rhoda D. Levin, and Sherif A. Kafafi
Ionization energy determinations
IE (eV) | Method | Reference | Comment |
---|---|---|---|
8.05 | PE | Bock and Kaim, 1980 | Vertical value |

References

Bock and Kaim, 1980
Bock, H.; Kaim, W.,
Radical ions. 37. Ionization and one-electron oxidation of electron-rich silylalkyl olefins,
J. Am. Chem. Soc., 1980, 102, 4429. [all data]