2-Butynylbenzene
- Formula: C10H10
- Molecular weight: 130.1864
- IUPAC Standard InChIKey: PXKSPZIOORAWIT-UHFFFAOYSA-N
- CAS Registry Number: 33598-22-0
- Chemical structure:
View 3d structure (requires JavaScript / HTML 5) - Permanent link for this species. Use this link for bookmarking this species for future reference.

Gas phase ion energetics data

Data compiled as indicated in comments:
LLK - Sharon G. Lias, Rhoda D. Levin, and Sherif A. Kafafi
Ionization energy determinations
IE (eV) | Method | Reference | Comment |
---|---|---|---|
8.6 | EI | Koppel, Schwarz, et al., 1974 | LLK |

References

Koppel, Schwarz, et al., 1974
Koppel, C.; Schwarz, H.; Bohlmann, F.,
Elektronenstossinduzierte fragmentierung von acetylenverbindungen,
Org. Mass Spectrom., 1974, 9, 324. [all data]