Cyclopentane, 1,2-dibromo-cis-
- Formula: C5H8Br2
- Molecular weight: 227.925
- IUPAC Standard InChIKey: LJCGLSZQABMYGU-SYDPRGILSA-N
- CAS Registry Number: 33547-17-0
- Chemical structure:
View 3d structure (requires JavaScript / HTML 5) - Stereoisomers:

Gas phase ion energetics data

Data compiled as indicated in comments:
LLK - Sharon G. Lias, Rhoda D. Levin, and Sherif A. Kafafi
Ionization energy determinations
IE (eV) | Method | Reference | Comment |
---|---|---|---|
10.02 ± 0.02 | PE | Botter, Menes, et al., 1973 | LLK |

References

Botter, Menes, et al., 1973
Botter, R.; Menes, F.; Gounelle, Y.; Pechine, J.M.; Solgadi, D.,
The ionization potentials of geometrical isomers: the cis and trans 2-subststituted cyclopentyl and cyclohexyl bromides,
Int. J. Mass Spectrom. Ion Phys., 1973, 12, 188. [all data]