3H-1,2-Dithiole-3-thione, 4-methyl-
- Formula: C4H4S3
- Molecular weight: 148.270
- IUPAC Standard InChIKey: YHKZVQYBNUVXKY-UHFFFAOYSA-N
- CAS Registry Number: 3354-41-4
- Chemical structure:
View 3d structure (requires JavaScript / HTML 5) - Permanent link for this species. Use this link for bookmarking this species for future reference.

Gas phase ion energetics data

Data compiled by: Sharon G. Lias, Rhoda D. Levin, and Sherif A. Kafafi
Ionization energy determinations
IE (eV) | Method | Reference | Comment |
---|---|---|---|
8.23 | PE | Gonbeau, Guimon, et al., 1975 | Vertical value |

References

Gonbeau, Guimon, et al., 1975
Gonbeau, D.; Guimon, C.; Deschamps, J.; Pfister-Guillouzo, G.,
Electronic structure of sulphur compounds IX. Photoelectron spectra of various 1,2-dithiole-3-thiones,
J. Electron Spectrosc. Relat. Phenom., 1975, 6, 99. [all data]