Phenol,4-iodo-,acetate
- Formula: C8H7IO2
- Molecular weight: 262.0445
- IUPAC Standard InChIKey: MXHYFISNECFQHA-UHFFFAOYSA-N
- CAS Registry Number: 33527-94-5
- Chemical structure:
View 3d structure (requires JavaScript / HTML 5) - Permanent link for this species. Use this link for bookmarking this species for future reference.

Gas phase ion energetics data

Data compiled by: Sharon G. Lias, Rhoda D. Levin, and Sherif A. Kafafi
Ionization energy determinations
IE (eV) | Method | Reference |
---|---|---|
8.20 ± 0.03 | EI | Benezra and Bursey, 1971 |
Appearance energy determinations
Ion | AE (eV) | Other Products | Method | Reference | Comment |
---|---|---|---|---|---|
C2H3O+ | 12.74 ± 0.03 | C6H4IO | EI | Benezra and Bursey, 1971 | |
C6H5OI+ | 9.38 ± 0.03 | CH2=C=O | EI | Benezra and Bursey, 1971 |

References

Benezra and Bursey, 1971
Benezra, S.A.; Bursey, M.M.,
ortho-Effects on ordering factors in mass spectral rearrangements. Loss of keten from halogenated phenyl acetates and acetanilides,
J. Chem. Soc. B, 1971, 1515. [all data]