Chrysene, 4-methyl-
- Formula: C19H14
- Molecular weight: 242.3145
- IUPAC Standard InChIKey: BLVHWJCLSMYFMT-UHFFFAOYSA-N
- CAS Registry Number: 3351-30-2
- Chemical structure:
View 3d structure (requires JavaScript / HTML 5) - Other names: 4-Methylchrysene

Phase change data

Data compiled by: William E. Acree, Jr., James S. Chickos
Enthalpy of fusion
ΔfusH (kJ/mol) | Temperature (K) | Method | Reference |
---|---|---|---|
18.3 | 424.0 | DSC | Kestens, Auclair, et al., 2010 |

Gas phase ion energetics data

Data compiled as indicated in comments:
LLK - Sharon G. Lias, Rhoda D. Levin, and Sherif A. Kafafi
Ionization energy determinations
IE (eV) | Method | Reference | Comment |
---|---|---|---|
7.44 ± 0.03 | PE | Shahbaz, Akiyama, et al., 1981 | LLK |

Gas Chromatography

Data compiled by: NIST Mass Spectrometry Data Center, William E. Wallace, director
Lee's RI, non-polar column, isothermal
Column type | Active phase | Temperature (C) | I | Reference | Comment |
---|---|---|---|---|---|
Packed | Methyl Silicone | 260. | 419.5 | Shlyakhov, 1984 | |
Packed | Methyl Silicone | 270. | 421.1 | Shlyakhov, 1984 |

Lee's RI, non-polar column, temperature ramp

Column type | Active phase | I | Reference | Comment |
---|---|---|---|---|
Capillary | DB-5MS | 419.63 | Sun, Zhou, et al., 2008 | 30. m/0.25 mm/0.25 μm, 50. C @ 2. min, 6. K/min, 300. C @ 16. min |
Capillary | SE-52 | 421.25 | Vassilaros, Kong, et al., 1982 | 20. m/0.30 mm/0.25 μm, H2, 40. C @ 2. min, 4. K/min; Tend: 265. C |
Capillary | SE-52 | 420.83 | Lee, Vassilaros, et al., 1979 | 12. m/0.3 mm/0.34 μm, He, 2. K/min; Tstart: 50. C; Tend: 250. C |

Lee's RI, non-polar column, custom temperature program

Column type | Active phase | I | Reference | Comment |
---|---|---|---|---|
Capillary | LM-5 | 420.74 | Ré-Poppi and Santiago-Silva, 2005 | 30. m/0.25 mm/0.25 μm, He; Program: 60C(2min) => 15C/min => 180C => 5C/min => 280C (10min) |
Capillary | HP-5 MS | 419.6 | Brack and Schirmer, 2003 | 30. m/0.25 mm/0.25 μm, Helium; Program: 70 0C 7 0C/min -> 280 0C (2 min) 7 0C/min -> 300 0C (2 min) |
Capillary | LM-5 | 420.91 | Ré-Poppi and Santiago-Silva, 2002 | 30. m/0.25 mm/0.25 μm, He; Program: 60C(2min) => 15C/min => 180C => 5C/min => 280C(5min) |
Capillary | SE-52 | 418.57 | Shlyakhov, 1984 | Program: not specified |
Capillary | SE-52 | 419.68 | Shlyakhov, 1984 | Program: not specified |
Capillary | SE-52 | 420.83 | Shlyakhov, 1984 | Program: not specified |

References

Kestens, Auclair, et al., 2010
Kestens, Vikram; Auclair, Guy; Drozdzewska, Katarzyna; Held, Andrea; Roebben, Gert; Linsinger, Thomas,
Thermodynamic property values of selected polycyclic aromatic hydrocarbons measured by differential scanning calorimetry,
J Therm Anal Calorim, 2010, 99, 1, 245-261, https://doi.org/10.1007/s10973-009-0440-6
. [all data]
Shahbaz, Akiyama, et al., 1981
Shahbaz, M.; Akiyama, I.; LeBreton, P.,
Ultraviolet photoelectron studies of methyl substituted chrysenes,
Biochem. Biophys. Res. Commun., 1981, 103, 25. [all data]
Shlyakhov, 1984
Shlyakhov, A.F.,
Gas chromatography in organic geochemistry, Nedra, Moscow, 1984, 221. [all data]
Sun, Zhou, et al., 2008
Sun, P.; Zhou, Q.; Li, G.; Wang, X.; Zhao, Y.; Cao, L.,
fingerprint analysis of polycyclic aromatic hydrocarbons in crude oil by internal standard method,
J. Instrumental Anal., 2008, 27, 4, 344-348. [all data]
Vassilaros, Kong, et al., 1982
Vassilaros, D.L.; Kong, R.C.; Later, D.W.; Lee, M.L.,
Linear retention index system for polycyclic aromatic compounds. Critical evaluation and additional indices,
J. Chromatogr., 1982, 252, 1-20, https://doi.org/10.1016/S0021-9673(01)88394-1
. [all data]
Lee, Vassilaros, et al., 1979
Lee, M.L.; Vassilaros, D.L.; White, C.M.; Novotny, M.,
Retention Indices for Programmed-Temperature Capillary-Column Gas Chromatography of Polycyclic Aromatic Hydrocarbons,
Anal. Chem., 1979, 51, 6, 768-773, https://doi.org/10.1021/ac50042a043
. [all data]
Ré-Poppi and Santiago-Silva, 2005
Ré-Poppi, N.; Santiago-Silva, M.,
Polycyclic aromatic hydrocarbons and other selected organic compounds in ambient air of Campo Grande City, Brazil,
Atmos. Environ., 2005, 39, 16, 2839-2850, https://doi.org/10.1016/j.atmosenv.2004.10.006
. [all data]
Brack and Schirmer, 2003
Brack, W.; Schirmer, K.,
Effect-directed identification of oxygen and sulfur heterocycles as major polycyclic aromatic cytochrome P4501A-inducers in a contaminated sedimet,
Environ. Sci. Technol., 2003, 37, 14, 3062-3070, https://doi.org/10.1021/es020248j
. [all data]
Ré-Poppi and Santiago-Silva, 2002
Ré-Poppi, N.; Santiago-Silva, M.R.,
Identification of polycyclic aromatic hydrocarbons and methoxylated phenols in wood smoke emitted during production of charcoal,
Chromatographia, 2002, 55, 7/8, 475-481, https://doi.org/10.1007/BF02492280
. [all data]