1,1-dimethoxysilacyclobutane
- Formula: C5H12O2Si
- Molecular weight: 132.2331
- IUPAC Standard InChIKey: GZUPUZMCIXFGMH-UHFFFAOYSA-N
- CAS Registry Number: 33446-84-3
- Chemical structure:
View 3d structure (requires JavaScript / HTML 5) - Other names: Silacyclobutane, 1,1-dimethoxy-

Gas phase ion energetics data

Data compiled by: Sharon G. Lias, Rhoda D. Levin, and Sherif A. Kafafi
Ionization energy determinations
IE (eV) | Method | Reference | Comment |
---|---|---|---|
10.15 | PE | Cundy, Lappert, et al., 1973 | Vertical value |

References

Cundy, Lappert, et al., 1973
Cundy, C.S.; Lappert, M.F.; Pedley, J.B.; Schmidt, W.; Wilkins, B.T.,
Bonding studies of compounds of boron and the Group IV elements. XI. Photoelectron spectra of strained cyclic organosilicon compounds,
J. Organomet. Chem., 1973, 51, 99. [all data]