Benzene,1-methyl-2-(1-methylethoxy)-
- Formula: C10H14O
- Molecular weight: 150.2176
- IUPAC Standard InChIKey: ONNCZAPKYZWFHQ-UHFFFAOYSA-N
- CAS Registry Number: 33426-60-7
- Chemical structure:
View 3d structure (requires JavaScript / HTML 5) - Permanent link for this species. Use this link for bookmarking this species for future reference.

Gas phase ion energetics data

Data compiled by: Sharon G. Lias, Rhoda D. Levin, and Sherif A. Kafafi
Ionization energy determinations
IE (eV) | Method | Reference | Comment |
---|---|---|---|
8.24 | PE | Friege and Klessinger, 1979 | Vertical value |

References

Friege and Klessinger, 1979
Friege, H.; Klessinger, M.,
Elektronenstruktur von Alkyl-aryl- und Alkyl-vinyl-ethern,
Chem. Ber., 1979, 112, 1614. [all data]