Pyridine,1,4-dihydro-
- Formula: C5H7N
- Molecular weight: 81.1158
- IUPAC Standard InChIKey: YNGDWRXWKFWCJY-UHFFFAOYSA-N
- CAS Registry Number: 3337-17-5
- Chemical structure:
View 3d structure (requires JavaScript / HTML 5) - Permanent link for this species. Use this link for bookmarking this species for future reference.

Gas phase ion energetics data

Data compiled by: Sharon G. Lias, Rhoda D. Levin, and Sherif A. Kafafi
Ionization energy determinations
IE (eV) | Method | Reference | Comment |
---|---|---|---|
7.46 | PE | Dolby, Hanson, et al., 1976 | Vertical value |

References

Dolby, Hanson, et al., 1976
Dolby, L.J.; Hanson, G.; Koenig, T.,
The He I photoelectron spectra of N-methylisoindole and N-methylindole,
J. Org. Chem., 1976, 41, 3537. [all data]