Ferrocene, 1,1',2,2',3,3'-hexachloro-
- Formula: C10H4Cl6Fe
- Molecular weight: 392.702
- IUPAC Standard InChIKey: ZZCMVFJCIHYRCS-UHFFFAOYSA-N
- CAS Registry Number: 33306-55-7
- Chemical structure:
View 3d structure (requires JavaScript / HTML 5) - Other names: Ferrocene, hexachloro-

Gas phase ion energetics data

Data compiled by: Sharon G. Lias and Joel F. Liebman
Ionization energy determinations
IE (eV) | Method | Reference |
---|---|---|
7.38 ± 0.05 | PI | Barfuss, Emrich, et al., 1990 |
7.5 ± 0.1 | EI | Barfuss, Emrich, et al., 1990 |
Appearance energy determinations
Ion | AE (eV) | Other Products | Method | Reference | Comment |
---|---|---|---|---|---|
C5H2+ | 21.0 ± 0.3 | ? | EI | Barfuss, Emrich, et al., 1990 | |
C5H2Cl+ | 16.1 ± 0.1 | ? | PI | Barfuss, Emrich, et al., 1990 | |
C5H2Cl+ | 17.1 ± 0.3 | ? | EI | Barfuss, Emrich, et al., 1990 | |
C5H2Cl3+ | 14.4 ± 0.1 | ? | PI | Barfuss, Emrich, et al., 1990 | |
C5H2Cl3+ | 15.3 ± 0.3 | ? | EI | Barfuss, Emrich, et al., 1990 | |
C5H2Cl3Fe+ | 14.9 ± 0.3 | ? | EI | Barfuss, Emrich, et al., 1990 | |
C5H2Cl3Fe+ | 13.9 ± 0.1 | ? | PI | Barfuss, Emrich, et al., 1990 | |
C10H4Cl2+ | 13.2 ± 0.1 | ? | PI | Barfuss, Emrich, et al., 1990 | |
C10H4Cl2+ | 15.6 ± 0.3 | ? | EI | Barfuss, Emrich, et al., 1990 | |
C10H4Cl3+ | 12.6 ± 0.1 | ? | PI | Barfuss, Emrich, et al., 1990 | |
C10H4Cl3+ | 13.8 ± 0.2 | ? | EI | Barfuss, Emrich, et al., 1990 | |
C10H4Cl4+ | 11.1 ± 0.3 | ? | PI | Barfuss, Emrich, et al., 1990 | |
C10H4Cl4+ | 12.1 ± 0.2 | ? | EI | Barfuss, Emrich, et al., 1990 |

References

Barfuss, Emrich, et al., 1990
Barfuss, S.; Emrich, R.-H.; Hirschwald, W.; Dowben, P.A.; Boag, N.M.,
A mass spectrometric investigation of chloro-, bromo- and methyl-ferrocenes by electron and photon impact ionisation,
J. Org. Chem., 1990, 391, 209. [all data]