Dibenzo[b,e]thiepin-11(6H)-one-5,5-dioxide
- Formula: C14H10O3S
- Molecular weight: 258.292
- IUPAC Standard InChIKey: RXQLFFXTZURZDP-UHFFFAOYSA-N
- CAS Registry Number: 33301-21-2
- Chemical structure:
View 3d structure (requires JavaScript / HTML 5) - Permanent link for this species. Use this link for bookmarking this species for future reference.

Gas phase ion energetics data

Data compiled by: Sharon G. Lias, Rhoda D. Levin, and Sherif A. Kafafi
Ionization energy determinations
IE (eV) | Method | Reference |
---|---|---|
9.70 | EI | Sahini, Constantin, et al., 1978 |
Appearance energy determinations
Ion | AE (eV) | Other Products | Method | Reference | Comment |
---|---|---|---|---|---|
C14H10O+ | 10.00 | SO2 | EI | Sahini, Constantin, et al., 1978 |

References

Sahini, Constantin, et al., 1978
Sahini, V.E.; Constantin, V.; Serban, I.; Vladescu, C.,
Electron-impact-induced fragmentation of some dibenzo[b,e]thiepines,
Rev. Roum. Chim., 1978, 23, 315. [all data]