2-Furancarboxylic acid, hydrazide
- Formula: C5H6N2O2
- Molecular weight: 126.1133
- IUPAC Standard InChIKey: SKTSVWWOAIAIKI-UHFFFAOYSA-N
- CAS Registry Number: 3326-71-4
- Chemical structure:
View 3d structure (requires JavaScript / HTML 5) - Other names: 2-Furoic acid, hydrazide; Furoic acid, hydrazide; Furoylhydrazide; 2-Furancarbohydrazonic acid; 2-Furoylhydrazide; 2-Furylcarbonylhydrazide; 2-Furylcarboxylic acid hydrazide; 2-Furohydrazide; 2-Furancarbohydrazide; 2-Furancarbonyl hydrazide; 2-Furoic hydrazide; NSC 11957; NSC 35574; Pyromucic acid hydrazide

Phase change data

Data compiled by: William E. Acree, Jr., James S. Chickos
Quantity | Value | Units | Method | Reference | Comment |
---|---|---|---|---|---|
ΔsubH° | 99.0 ± 0.7 | kJ/mol | ME | Ribeiro da Silva, Amaral, et al., 2008 | Based on data from 309. to 325. K. |
Enthalpy of sublimation
ΔsubH (kJ/mol) | Temperature (K) | Method | Reference | Comment |
---|---|---|---|---|
98.1 ± 0.7 | 317.2 | ME | Ribeiro da Silva, Amaral, et al., 2008 | Based on data from 309. to 325. K. |

References

Ribeiro da Silva, Amaral, et al., 2008
Ribeiro da Silva, Manuel A.V.; Amaral, Lui´sa M.P.F.; Santos, Ana Filipa L.O.M.,
Thermochemical and thermophysical study of 2-thiophenecarboxylic acid hydrazide and 2-furancarboxylic acid hydrazide,
The Journal of Chemical Thermodynamics, 2008, 40, 11, 1588-1593, https://doi.org/10.1016/j.jct.2008.06.011
. [all data]