Azobenzene, 4,4'-difluoro-

Gas phase ion energetics data

Data compiled by: Sharon G. Lias and Joel F. Liebman

Ionization energy determinations

IE (eV) Method Reference Comment
8.5PEPetrachenko, Vovna, et al., 1993Vertical value

References

Petrachenko, Vovna, et al., 1993
Petrachenko, N.E.; Vovna, V.I.; Furin, G.G., Photoelectron HeI spectra of fluorinated azo- and azoxy-benzenes, J. Fluorine Chem., 1993, 63, 85. [all data]