Piperidine, 1-cyclohexyl-
- Formula: C11H21N
- Molecular weight: 167.2911
- IUPAC Standard InChIKey: DSSKLTAHHALFRW-UHFFFAOYSA-N
- CAS Registry Number: 3319-01-5
- Chemical structure:
View 3d structure (requires JavaScript / HTML 5) - Other names: Cyclohexylpiperidine; N-Cyclohexylpiperidine; 1-Cyclohexylpiperidine; 1-Piperidinocyclohexane

Condensed phase thermochemistry data

Data compiled by: Hussein Y. Afeefy, Joel F. Liebman, and Stephen E. Stein
Quantity | Value | Units | Method | Reference | Comment |
---|---|---|---|---|---|
ΔfH°liquid | -205.4 | kJ/mol | Ccb | Prochazka, Krestanova, et al., 1970 | |
Quantity | Value | Units | Method | Reference | Comment |
ΔcH°liquid | -7124. ± 11. | kJ/mol | Ccb | Prochazka, Krestanova, et al., 1970 |

Phase change data

Data compiled by: William E. Acree, Jr., James S. Chickos
Quantity | Value | Units | Method | Reference | Comment |
---|---|---|---|---|---|
ΔvapH° | 60.5 ± 0.6 | kJ/mol | GS | Verevkin, 1998 | Based on data from 288. to 328. K. |
Enthalpy of vaporization
ΔvapH (kJ/mol) | Temperature (K) | Method | Reference | Comment |
---|---|---|---|---|
59.9 ± 0.6 | 308. | GS | Verevkin, 1998 | Based on data from 288. to 328. K. |

Gas phase ion energetics data

Data compiled as indicated in comments:
LLK - Sharon G. Lias, Rhoda D. Levin, and Sherif A. Kafafi
Ionization energy determinations
IE (eV) | Method | Reference | Comment |
---|---|---|---|
7.93 ± 0.03 | PE | Colonna, Distefano, et al., 1975 | Vertical value; LLK |

Kovats' RI, non-polar column, isothermal

Column type | Active phase | Temperature (C) | I | Reference | Comment |
---|---|---|---|---|---|
Packed | SE-30 | 120. | 1317. | Pascal, Heintz, et al., 1974 | Column length: 2. m |
Packed | SE-30 | 140. | 1329. | Pascal, Heintz, et al., 1974 | Column length: 2. m |
Packed | SE-30 | 160. | 1340. | Pascal, Heintz, et al., 1974 | Column length: 2. m |

Kovats' RI, polar column, isothermal

Column type | Active phase | Temperature (C) | I | Reference | Comment |
---|---|---|---|---|---|
Packed | Carbowax 20M | 120. | 1535. | Pascal, Heintz, et al., 1974 | Column length: 2. m |
Packed | Carbowax 20M | 140. | 1553. | Pascal, Heintz, et al., 1974 | Column length: 2. m |
Packed | Carbowax 20M | 160. | 1571. | Pascal, Heintz, et al., 1974 | Column length: 2. m |

References

Prochazka, Krestanova, et al., 1970
Prochazka, M.; Krestanova, V.; Palecek, M.; Pecka, K.,
The heats of formation of some enamines,
Collect. Czech. Chem. Commun., 1970, 35, 3813-3817. [all data]
Verevkin, 1998
Verevkin, Sergey P.,
Structural Chemistry, 1998, 9, 2, 113-119, https://doi.org/10.1023/A:1022459803871
. [all data]
Colonna, Distefano, et al., 1975
Colonna, F.P.; Distefano, G.; Pignataro, S.; Pitacco, G.; Valentin, E.,
Ionization energies of some amines and enamines and an estimation of their relative basicity in gaseous phase,
J. Chem. Soc. Faraday Trans. 2, 1975, 71, 1572. [all data]
Pascal, Heintz, et al., 1974
Pascal, J.C.; Heintz, M.; Druilhe, A.; Lefort, D.,
Relations entre structure chimique et grandeurs de rétention. III. Stéréoisomères cyclohexaniques,
Chromatographia, 1974, 7, 5, 236-245, https://doi.org/10.1007/BF02321774
. [all data]