Methylidyne
- Formula: CH
- Molecular weight: 13.0186
- IUPAC Standard InChIKey: VRLIPUYDFBXWCH-UHFFFAOYSA-N
- CAS Registry Number: 3315-37-5
- Chemical structure:
View 3d structure (requires JavaScript / HTML 5) - Isotopologues:

Gas phase thermochemistry data

Quantity | Value | Units | Method | Reference | Comment |
---|---|---|---|---|---|
ΔfH°gas | 594.13 | kJ/mol | Review | Chase, 1998 | Data last reviewed in December, 1967 |
Quantity | Value | Units | Method | Reference | Comment |
S°gas,1 bar | 183.04 | J/mol*K | Review | Chase, 1998 | Data last reviewed in December, 1967 |
Gas Phase Heat Capacity (Shomate Equation)
Cp° = A + B*t + C*t2 + D*t3 +
E/t2
H° − H°298.15= A*t + B*t2/2 +
C*t3/3 + D*t4/4 − E/t + F − H
S° = A*ln(t) + B*t + C*t2/2 + D*t3/3 −
E/(2*t2) + G
Cp = heat capacity (J/mol*K)
H° = standard enthalpy (kJ/mol)
S° = standard entropy (J/mol*K)
t = temperature (K) / 1000.
View plot Requires a JavaScript / HTML 5 canvas capable browser.
Temperature (K) | 298. to 1100. | 1100. to 6000. |
---|---|---|
A | 32.94210 | 30.15367 |
B | -16.71056 | 8.455112 |
C | 24.18595 | -1.969644 |
D | -7.784709 | 0.154270 |
E | -0.065198 | -4.980090 |
F | 584.6303 | 576.6891 |
G | 226.5138 | 209.3531 |
H | 594.1280 | 594.1280 |
Reference | Chase, 1998 | Chase, 1998 |
Comment | Data last reviewed in December, 1967 | Data last reviewed in December, 1967 |

Reaction thermochemistry data

Data compiled by: John E. Bartmess
Individual Reactions
(CHCl- • 4294967295) +
= CHCl-
By formula: (CHCl- • 4294967295CH) + CH = CHCl-
Quantity | Value | Units | Method | Reference | Comment |
---|---|---|---|---|---|
ΔrH° | 158. ± 9.6 | kJ/mol | CIDT | Jesinger and Squires, 1999 | gas phase |
ΔrH° | 159. ± 8.4 | kJ/mol | N/A | Gilles, Ervin, et al., 1992 | gas phase; Triplet state is 4.2±2.5 kcal/mol higher in energy than neutral singlet |
Quantity | Value | Units | Method | Reference | Comment |
---|---|---|---|---|---|
ΔrH° | 1529.4 ± 0.71 | kJ/mol | D-EA | Scheer, Bilodeau, et al., 1998 | gas phase; Given: 1.262119(20) eV |
Quantity | Value | Units | Method | Reference | Comment |
ΔrG° | 1506.2 ± 1.1 | kJ/mol | H-TS | Scheer, Bilodeau, et al., 1998 | gas phase; Given: 1.262119(20) eV |

Gas phase ion energetics data

Data evaluated as indicated in comments:
L - Sharon G. Lias
Data compiled as indicated in comments:
B - John E. Bartmess
LLK - Sharon G. Lias, Rhoda D. Levin, and Sherif A. Kafafi
RDSH - Henry M. Rosenstock, Keith Draxl, Bruce W. Steiner, and John T. Herron
Quantity | Value | Units | Method | Reference | Comment |
---|---|---|---|---|---|
IE (evaluated) | 10.64 ± 0.01 | eV | N/A | N/A | L |
Electron affinity determinations
EA (eV) | Method | Reference | Comment |
---|---|---|---|
1.260 ± 0.020 | N/A | Goebbert, 2012 | B |
1.2380 ± 0.0078 | LPES | Kasdan, Herbst, et al., 1975 | B |
0.740 ± 0.050 | PD | Feldman, 1970 | B |
2.60 ± 0.30 | EIAE | Locht and Momigny, 1970 | From CH4,C2H2,C2H4; B |
Ionization energy determinations
IE (eV) | Method | Reference | Comment |
---|---|---|---|
10.64 | EVAL | Huber and Herzberg, 1979 | LLK |
10.64 ± 0.01 | S | Herzberg and Johns, 1969 | RDSH |
De-protonation reactions
Quantity | Value | Units | Method | Reference | Comment |
---|---|---|---|---|---|
ΔrH° | 1529.4 ± 0.71 | kJ/mol | D-EA | Scheer, Bilodeau, et al., 1998 | gas phase; Given: 1.262119(20) eV; B |
Quantity | Value | Units | Method | Reference | Comment |
ΔrG° | 1506.2 ± 1.1 | kJ/mol | H-TS | Scheer, Bilodeau, et al., 1998 | gas phase; Given: 1.262119(20) eV; B |

Constants of diatomic molecules

Data compiled by: Klaus P. Huber and Gerhard H. Herzberg
Data collected through August, 1976
Symbol | Meaning |
---|---|
State | electronic state and / or symmetry symbol |
Te | minimum electronic energy (cm-1) |
ωe | vibrational constant – first term (cm-1) |
ωexe | vibrational constant – second term (cm-1) |
ωeye | vibrational constant – third term (cm-1) |
Be | rotational constant in equilibrium position (cm-1) |
αe | rotational constant – first term (cm-1) |
γe | rotation-vibration interaction constant (cm-1) |
De | centrifugal distortion constant (cm-1) |
βe | rotational constant – first term, centrifugal force (cm-1) |
re | internuclear distance (Å) |
Trans. | observed transition(s) corresponding to electronic state |
ν00 | position of 0-0 band (units noted in table) |
State | Te | ωe | ωexe | ωeye | Be | αe | γe | De | βe | re | Trans. | ν00 |
---|---|---|---|---|---|---|---|---|---|---|---|---|
Rydberg | Several unassigned absorption bands 1 above 80000 cm-1. | |||||||||||
↳Herzberg and Johns, 1969 | ||||||||||||
Rydberg series joining on to G, ν = 85850 -R/(n-0.09)2; n = 3,4,5,6 | ||||||||||||
↳missing citation | ||||||||||||
G | [74373] 2 | G ← X | 72960 | |||||||||
↳missing citation | ||||||||||||
F 2Σ+ | [65945] | [12.17] 3 | [1.221] | F ← X R | 64531.5 4 Z | |||||||
↳missing citation | ||||||||||||
State | Te | ωe | ωexe | ωeye | Be | αe | γe | De | βe | re | Trans. | ν00 |
E 2Π | [65625] | [12.6] 5 | [1.2] | E ← X R | 64211.7 4 Z | |||||||
↳missing citation | ||||||||||||
D 2Πi | [60394] 6 | [13.7] 5 | [1.15] | D ← B V | 33282.8 4 Z | |||||||
↳missing citation | ||||||||||||
D ← X | 58981 4 Z | |||||||||||
↳missing citation | ||||||||||||
C 2Σ+ | 31801.5 | 2840.2 Z | 125.96 7 | 13.55 | 14.603 8 9 | 0.7185 10 | [0.001555] 11 | 1.1143 | C ↔ X 12 13 VR | 31778.1 4 Z | ||
↳Heimer, 1932; Gero, 1941; missing citation; Herzberg and Johns, 1969 | ||||||||||||
State | Te | ωe | ωexe | ωeye | Be | αe | γe | De | βe | re | Trans. | ν00 |
B 2Σ- | (26044) | [1794.9] 14 Z | [12.645] 15 9 | 16 | [0.00222] 17 | [1.1975] | B ↔ X 18 13 R | 25698.2 4 Z | ||||
↳missing citation; Gero, 1941; missing citation; missing citation | ||||||||||||
A 2Δ | 23189.8 19 | 2930.7 Z | 96.65 | 14.934 20 9 | 0.697 | 0.00154 | 0.00004 | 1.1019 | A ↔ X 21 13 V | 23217.5 4 Z | ||
↳Gero, 1941; Kiess and Broida, 1956; missing citation; missing citation | ||||||||||||
a 4Σ- | (5844) | (3145) | (72) | (15.4) | (0.55) | (1.085) | 5985 22 | |||||
↳Kasdan, Herbst, et al., 1975 | ||||||||||||
X 2Πr | 0 23 | 2858.5 Z | 63.02 | 14.457 24 25 9 | 0.534 | 0.00145 | 1.1199 26 | |||||
↳Rydbeck, Ellder, et al., 1973 | ||||||||||||
Ab initio calculations | ||||||||||||
↳Meyer and Rosmus, 1975 |

References

Chase, 1998
Chase, M.W., Jr.,
NIST-JANAF Themochemical Tables, Fourth Edition,
J. Phys. Chem. Ref. Data, Monograph 9, 1998, 1-1951. [all data]
Jesinger and Squires, 1999
Jesinger, R.A.; Squires, R.R.,
Carbyne thermochemistry from energy-resolved collision-induced dissociation. The heats of formation of CH, CF, and CCl,
Int. J. Mass Spectrom., 1999, 187, 745-757, https://doi.org/10.1016/S1387-3806(98)14182-9
. [all data]
Gilles, Ervin, et al., 1992
Gilles, M.K.; Ervin, K.M.; Ho, J.; Lineberger, W.C.,
Negative Ion Photoelectron Spectroscopy of HCF-, HCCl-, HCBr-, and HCI- - Photoelectron Angular Distributions and Neutral Triplet Excitation,
J. Phys. Chem., 1992, 96, 3, 1130, https://doi.org/10.1021/j100182a021
. [all data]
Scheer, Bilodeau, et al., 1998
Scheer, M.; Bilodeau, R.C.; Brodie, C.A.; Haugen, H.K.,
Systematic study of the stable states of C-, Si-, Ge-, and Sn- via infrared laser spectroscopy,
Phys. Rev. A, 1998, 58, 4, 2844-2856, https://doi.org/10.1103/PhysRevA.58.2844
. [all data]
Goebbert, 2012
Goebbert, D.J.,
Photoelectron imaging of CH-,
Chem. Phys. Lett., 2012, 551, 19-25, https://doi.org/10.1016/j.cplett.2012.08.065
. [all data]
Kasdan, Herbst, et al., 1975
Kasdan, A.; Herbst, E.; Lineberger, W.C.,
Laser photoelectron spectrometry of CH2-,
Chem. Phys. Lett., 1975, 31, 78. [all data]
Feldman, 1970
Feldman, D.,
Photoablosung von Elektronen bei einigen Stabilen Negativen Ionen,
Z. Naturfor., 1970, 25A, 621. [all data]
Locht and Momigny, 1970
Locht, R.; Momigny, J.,
Mass Spectrometric Determination of the Electron Affinities of Radicals,
Chem. Phys. Lett., 1970, 6, 4, 273, https://doi.org/10.1016/0009-2614(70)85072-2
. [all data]
Huber and Herzberg, 1979
Huber, K.P.; Herzberg, G.,
Molecular Spectra and Molecular Structure. IV. Constants of Diatomic Molecules,, Van Nostrand Reinhold Co., 1979, ,1. [all data]
Herzberg and Johns, 1969
Herzberg, G.; Johns, J.W.C.,
New spectra of the CH molecule,
Astrophys. J., 1969, 158, 399. [all data]