Hexa-1,2-diene-5-yne
- Formula: C6H6
- Molecular weight: 78.1118
- IUPAC Standard InChIKey: BIFVSVOAVBNUKC-UHFFFAOYSA-N
- CAS Registry Number: 33142-15-3
- Chemical structure:
View 3d structure (requires JavaScript / HTML 5) - Permanent link for this species. Use this link for bookmarking this species for future reference.

Gas phase ion energetics data

Data compiled as indicated in comments:
LBLHLM - Sharon G. Lias, John E. Bartmess, Joel F. Liebman, John L. Holmes, Rhoda D. Levin, and W. Gary Mallard
LLK - Sharon G. Lias, Rhoda D. Levin, and Sherif A. Kafafi
Ionization energy determinations
IE (eV) | Method | Reference | Comment |
---|---|---|---|
9.40 | PE | Rosenstock, Dannacher, et al., 1982 | LBLHLM |
9.65 ± 0.02 | PE | Bieri, Burger, et al., 1977 | Vertical value; LLK |
9.65 | PE | Bischof, Gleiter, et al., 1975 | Vertical value; LLK |

References

Rosenstock, Dannacher, et al., 1982
Rosenstock, H.M.; Dannacher, J.; Liebman, J.F.,
The role of excited electronic states in ion fragmentation: C6H6+,
Radiat. Phys. Chem., 1982, 20, 7. [all data]
Bieri, Burger, et al., 1977
Bieri, G.; Burger, F.; Heilbronner, E.; Maier, J.P.,
Valence ionization enrgies of hydrocarbons,
Helv. Chim. Acta, 1977, 60, 2213. [all data]
Bischof, Gleiter, et al., 1975
Bischof, P.; Gleiter, R.; Hopf, H.; Lenich, F.T.,
Photoelectron spectra of open chain C6H6 isomers,
J. Am. Chem. Soc., 1975, 97, 5467. [all data]