Chromium, bis[(1,2,3,4,4a,8a-η)-naphthalene]-
- Formula: C20H16Cr
- Molecular weight: 308.3371
- IUPAC Standard InChIKey: PTHFXGJFVOYJML-UHFFFAOYSA-N
- CAS Registry Number: 33085-81-3
- Chemical structure:

Gas phase ion energetics data

Data compiled by: Henry M. Rosenstock, Keith Draxl, Bruce W. Steiner, and John T. Herron
Ionization energy determinations
IE (eV) | Method | Reference |
---|---|---|
5.9 ± 0.1 | EI | Herberich and Muller, 1969 |
Appearance energy determinations
Ion | AE (eV) | Other Products | Method | Reference | Comment |
---|---|---|---|---|---|
C12H10Cr+ | 9.5 ± 0.1 | ? | EI | Herberich and Muller, 1969 | |
Cr+ | 12.3 ± 0.2 | ? | EI | Herberich and Muller, 1969 |

References

Herberich and Muller, 1969
Herberich, G.E.; Muller, J.,
Massenspektren und Stabilitaten von Diaromatenchrom-Komplexen,
J.Organometal. Chem., 1969, 16, 111. [all data]