1,1,2,2,3,3,4,4,5,5,6,6,7,7,8,8,9,9,-Octadecafluoro-2,3,4,5,6,7,8,9-octahydro-1H-trindene
- Formula: C15F18
- Molecular weight: 522.1318
- IUPAC Standard InChIKey: SQXQBXPDVRWDQA-UHFFFAOYSA-N
- CAS Registry Number: 33021-47-5
- Chemical structure:
View 3d structure (requires JavaScript / HTML 5) - Permanent link for this species. Use this link for bookmarking this species for future reference.

Gas phase ion energetics data

Data compiled as indicated in comments:
LBLHLM - Sharon G. Lias, John E. Bartmess, Joel F. Liebman, John L. Holmes, Rhoda D. Levin, and W. Gary Mallard
Ionization energy determinations
IE (eV) | Method | Reference | Comment |
---|---|---|---|
11.3 | PE | Heilbronner, Wirz, et al., 1984 | LBLHLM |
11.65 | PE | Heilbronner, Wirz, et al., 1984 | Vertical value; LBLHLM |

References

Heilbronner, Wirz, et al., 1984
Heilbronner, E.; Wirz, J.; Soulen, R.L.,
6. The He(Iα) photoelectron spectra of the perfluoroderivatives of trisannelated benzenes and tetrakisannelated cyclooctatetraenes,
Helv. Chim. Acta, 1984, 67, 47. [all data]