Plumbane, (1,1-dimethylethyl)trimethyl-
- Formula: C7H18Pb
- Molecular weight: 309.4
- IUPAC Standard InChIKey: JHTNLGMYIYXAEG-UHFFFAOYSA-N
- CAS Registry Number: 32997-03-8
- Chemical structure:
View 3d structure (requires JavaScript / HTML 5) - Other names: Plumbane, tert-butyltrimethyl-; tert-Butyltrimethyllead; tert-Butyl(trimethyl)plumbane

Gas phase ion energetics data

Data compiled by: Sharon G. Lias, Rhoda D. Levin, and Sherif A. Kafafi
Ionization energy determinations
IE (eV) | Method | Reference |
---|---|---|
7.99 ± 0.13 | EI | Lappert, Pedley, et al., 1971 |
Appearance energy determinations
Ion | AE (eV) | Other Products | Method | Reference | Comment |
---|---|---|---|---|---|
C4H9+ | 9.45 ± 0.15 | (CH3)3Pb | EI | Lappert, Pedley, et al., 1971 |

References

Lappert, Pedley, et al., 1971
Lappert, M.F.; Pedley, J.B.; Simpson, J.; Spalding, T.R.,
Bonding studies of compounds of boron and the Group IV elements. VI. Mass spectrometric studies on compounds Me4M and Me3M-M'Me3 (M and M'=C, Si, Ge, Sn, and Pb): thermochemical data,
J. Organomet. Chem., 1971, 29, 195. [all data]