1H-Indene, octahydro-, trans-
- Formula: C9H16
- Molecular weight: 124.2233
- IUPAC Standard InChIKey: BNRNAKTVFSZAFA-IUCAKERBSA-N
- CAS Registry Number: 3296-50-2
- Chemical structure:
View 3d structure (requires JavaScript / HTML 5) - Stereoisomers:
- Other names: Indan, hexahydro-, trans-; trans-Bicyclo[4.3.0]nonane; trans-Hexahydroindan; trans-Hydrindane; trans-Perhydroindene; trans-Octahydro-1H-indene; Octahydro-1H-indene, trans; Indene, octahydro-, trans-; trans-Hydrindan; trans-Hexahydrindan

Gas phase thermochemistry data

Data compiled as indicated in comments:
ALS - Hussein Y. Afeefy, Joel F. Liebman, and Stephen E. Stein
GT - Glushko Thermocenter, Russian Academy of Sciences, Moscow
Quantity | Value | Units | Method | Reference | Comment |
---|---|---|---|---|---|
ΔfH°gas | -131.6 ± 2.1 | kJ/mol | Ccb | Browne and Rossini, 1960 | ALS |
Constant pressure heat capacity of gas
Cp,gas (J/mol*K) | Temperature (K) | Reference | Comment |
---|---|---|---|
150.00 | 298.15 | Chang S., 1970 | These values were calculated by a method of force field; their uncertainties may exceed 5-10 J/mol*K.; GT |
210.33 | 400. | ||
265.52 | 500. |

Condensed phase thermochemistry data

Data compiled as indicated in comments:
ALS - Hussein Y. Afeefy, Joel F. Liebman, and Stephen E. Stein
DH - Eugene S. Domalski and Elizabeth D. Hearing
Quantity | Value | Units | Method | Reference | Comment |
---|---|---|---|---|---|
ΔfH°liquid | -176.4 ± 1.7 | kJ/mol | Ccb | Browne and Rossini, 1960 | ALS |
Quantity | Value | Units | Method | Reference | Comment |
ΔcH°liquid | -5652.0 ± 1.7 | kJ/mol | Ccb | Browne and Rossini, 1960 | Corresponding ΔfHºliquid = -176.2 kJ/mol (simple calculation by NIST; no Washburn corrections); ALS |
ΔcH°liquid | -5640.9 ± 5.9 | kJ/mol | Ccb | Huckel, Kamenz, et al., 1937 | Reanalyzed by Cox and Pilcher, 1970, Original value = -5635. ± 8. kJ/mol; Corresponding ΔfHºliquid = -187.4 kJ/mol (simple calculation by NIST; no Washburn corrections); ALS |
Quantity | Value | Units | Method | Reference | Comment |
S°liquid | 258.86 | J/mol*K | N/A | Finke, McCullough, et al., 1972 | DH |
Constant pressure heat capacity of liquid
Cp,liquid (J/mol*K) | Temperature (K) | Reference | Comment |
---|---|---|---|
209.70 | 298.15 | Finke, McCullough, et al., 1972 | T = 10 to 400 K.; DH |

Phase change data

Data compiled as indicated in comments:
TRC - Thermodynamics Research Center, NIST Boulder Laboratories, Chris Muzny director
ALS - Hussein Y. Afeefy, Joel F. Liebman, and Stephen E. Stein
DRB - Donald R. Burgess, Jr.
AC - William E. Acree, Jr., James S. Chickos
DH - Eugene S. Domalski and Elizabeth D. Hearing
Quantity | Value | Units | Method | Reference | Comment |
---|---|---|---|---|---|
Tboil | 434.21 ± 0.04 | K | AVG | N/A | Average of 9 values; Individual data points |
Quantity | Value | Units | Method | Reference | Comment |
Tfus | 213.4 ± 0.6 | K | AVG | N/A | Average of 15 values; Individual data points |
Quantity | Value | Units | Method | Reference | Comment |
Ttriple | 213.86 | K | N/A | Finke, McCullough, et al., 1972, 2 | Uncertainty assigned by TRC = 0.01 K; TRC |
Ttriple | 213.8 | K | N/A | Anonymous, 1959 | Uncertainty assigned by TRC = 0.2 K; TRC |
Quantity | Value | Units | Method | Reference | Comment |
ΔvapH° | 44.8 ± 1.3 | kJ/mol | V | Browne and Rossini, 1960 | ALS |
ΔvapH° | 44.8 | kJ/mol | N/A | Browne and Rossini, 1960 | DRB |
Enthalpy of vaporization
ΔvapH (kJ/mol) | Temperature (K) | Method | Reference | Comment |
---|---|---|---|---|
45.1 | 296. | A | Stephenson and Malanowski, 1987 | Based on data from 281. to 362. K.; AC |
41.1 | 371. | A | Stephenson and Malanowski, 1987 | Based on data from 356. to 457. K.; AC |
45.9 | 272. | A | Stephenson and Malanowski, 1987 | Based on data from 262. to 283. K.; AC |
41.0 | 373. | A | Stephenson and Malanowski, 1987 | Based on data from 358. to 479. K.; AC |
41.6 | 360. | GS | Camin and Rossini, 1955 | Based on data from 345. to 435. K.; AC |
Enthalpy of fusion
ΔfusH (kJ/mol) | Temperature (K) | Reference | Comment |
---|---|---|---|
10.9052 | 213.86 | Finke, McCullough, et al., 1972 | DH |
10.9 | 213.9 | Finke, McCullough, et al., 1972 | AC |
Entropy of fusion
ΔfusS (J/mol*K) | Temperature (K) | Reference | Comment |
---|---|---|---|
50.99 | 213.86 | Finke, McCullough, et al., 1972 | DH |

Reaction thermochemistry data

Data compiled by: Hussein Y. Afeefy, Joel F. Liebman, and Stephen E. Stein
Individual Reactions
By formula: C9H16 = C9H16
Quantity | Value | Units | Method | Reference | Comment |
---|---|---|---|---|---|
ΔrH° | -3.10 | kJ/mol | Eqk | Finke, McCullough, et al., 1972 | liquid phase |
ΔrH° | -2.4 ± 0.2 | kJ/mol | Eqk | Blanchard and Schleyer, 1963 | liquid phase; Heat of isomerization |
ΔrH° | -4.5 ± 0.4 | kJ/mol | Eqk | Allinger and Coke, 1960 | liquid phase |
By formula: 8H2 + 2C9H8 = C9H16 + C9H16
Quantity | Value | Units | Method | Reference | Comment |
---|---|---|---|---|---|
ΔrH° | -585.2 ± 4.2 | kJ/mol | Chyd | Dolliver, Gresham, et al., 1937 | gas phase; Reanalyzed by Cox and Pilcher, 1970, Original value = -587.4 ± 4.2 kJ/mol; At 355 °K |
By formula: 6H2 + 2C9H10 = C9H16 + C9H16
Quantity | Value | Units | Method | Reference | Comment |
---|---|---|---|---|---|
ΔrH° | -377.1 ± 2.1 | kJ/mol | Chyd | Dolliver, Gresham, et al., 1937 | gas phase; Reanalyzed by Cox and Pilcher, 1970, Original value = -383. ± 2. kJ/mol; At 355 °K |
By formula: C9H16 = C9H16
Quantity | Value | Units | Method | Reference | Comment |
---|---|---|---|---|---|
ΔrH° | 4.456 | kJ/mol | Eqk | Finke, McCullough, et al., 1972 | gas phase |

Gas phase ion energetics data

Data compiled as indicated in comments:
LLK - Sharon G. Lias, Rhoda D. Levin, and Sherif A. Kafafi
RDSH - Henry M. Rosenstock, Keith Draxl, Bruce W. Steiner, and John T. Herron
Ionization energy determinations
IE (eV) | Method | Reference | Comment |
---|---|---|---|
9.46 ± 0.06 | PI | Mikaya and Zaikin, 1980 | LLK |
9.550 ± 0.004 | EI | Mikaya and Zaikin, 1980 | LLK |
10.18 ± 0.03 | EI | Natalis, 1963 | RDSH |
Appearance energy determinations
Ion | AE (eV) | Other Products | Method | Reference | Comment |
---|---|---|---|---|---|
C5H7+ | 12.19 ± 0.03 | C2H5+C2H4 | EI | Natalis, 1963 | RDSH |
C6H9+ | 12.07 ± 0.04 | ? | EI | Natalis, 1963 | RDSH |
C6H10+ | 11.00 ± 0.02 | C3H6 | EI | Natalis, 1963 | RDSH |
C7H11+ | 11.80 ± 0.05 | C2H5 | EI | Natalis, 1963 | RDSH |
C7H12+ | 11.16 ± 0.03 | C2H4 | EI | Natalis, 1963 | RDSH |

Kovats' RI, non-polar column, isothermal

Column type | Active phase | Temperature (C) | I | Reference | Comment |
---|---|---|---|---|---|
Packed | C78, Branched paraffin | 130. | 1001.9 | Dallos, Sisak, et al., 2000 | He; Column length: 3.3 m |
Packed | C78, Branched paraffin | 130. | 999.8 | Reddy, Dutoit, et al., 1992 | Chromosorb G HP; Column length: 3.3 m |
Capillary | SE-30 | 70. | 949.8 | Tóth, 1983 | N2; Column length: 15. m; Column diameter: 0.25 mm |
Capillary | SE-30 | 130. | 980. | Bredael, 1982 | Column length: 100. m; Column diameter: 0.5 mm |
Capillary | SE-30 | 80. | 955. | Bredael, 1982 | Column length: 100. m; Column diameter: 0.5 mm |
Capillary | Squalane | 90. | 961. | Engewald, Epsch, et al., 1976 | N2; Column length: 100. m; Column diameter: 0.23 mm |

Kovats' RI, polar column, isothermal

Column type | Active phase | Temperature (C) | I | Reference | Comment |
---|---|---|---|---|---|
Capillary | PEG-20M | 70. | 1059.3 | Tóth, 1983 | N2; Column length: 30. m; Column diameter: 0.3 mm |

Van Den Dool and Kratz RI, non-polar column, temperature ramp

Column type | Active phase | I | Reference | Comment |
---|---|---|---|---|
Capillary | DB-5 | 947.7 | Song, Lai, et al., 2003 | 30. m/0.25 mm/0.25 μm, He, 2. K/min; Tstart: 40. C; Tend: 310. C |
Capillary | DB-5 | 952.0 | Song, Lai, et al., 2003 | 30. m/0.25 mm/0.25 μm, He, 4. K/min; Tstart: 40. C; Tend: 310. C |
Capillary | DB-5 | 955.3 | Song, Lai, et al., 2003 | 30. m/0.25 mm/0.25 μm, He, 6. K/min; Tstart: 40. C; Tend: 310. C |
Capillary | DB-5 | 947.7 | Lai and Song, 1995 | 30. m/0.25 mm/0.25 μm, He, 2. K/min; Tstart: 40. C; Tend: 310. C |
Capillary | DB-5 | 952. | Lai and Song, 1995 | 30. m/0.25 mm/0.25 μm, He, 4. K/min; Tstart: 40. C; Tend: 310. C |
Capillary | DB-5 | 955.3 | Lai and Song, 1995 | 30. m/0.25 mm/0.25 μm, He, 6. K/min; Tstart: 40. C; Tend: 310. C |
Capillary | Petrocol DH | 948. | White, Hackett, et al., 1992 | 100. m/0.25 mm/0.5 μm, He, 1. K/min; Tstart: 30. C; Tend: 220. C |

Normal alkane RI, non-polar column, isothermal

Column type | Active phase | Temperature (C) | I | Reference | Comment |
---|---|---|---|---|---|
Packed | Polydimethyl siloxane | 110. | 964. | Ferrand, 1962 |

Normal alkane RI, non-polar column, custom temperature program

Column type | Active phase | I | Reference | Comment |
---|---|---|---|---|
Capillary | Polymethylsiloxane, (PMS-20000) | 950. | Cornwell and Cordano, 2003 | Program: not specified |
Capillary | OV-1, SE-30, Methyl silicone, SP-2100, OV-101, DB-1, etc. | 955. | Waggott and Davies, 1984 | Hydrogen; Column length: 50. m; Column diameter: 0.32 mm; Program: not specified |

Normal alkane RI, polar column, custom temperature program

Column type | Active phase | I | Reference | Comment |
---|---|---|---|---|
Capillary | Carbowax 20M | 1059. | Cornwell and Cordano, 2003 | Program: not specified |

References

Browne and Rossini, 1960
Browne, C.C.; Rossini, F.D.,
Heats of combustion, formation, and isomerization of the cis and trans isomers of hexahydroindan,
J. Phys. Chem., 1960, 64, 927-931. [all data]
Chang S., 1970
Chang S.,
The heats of combustion and strain energies of bicyclo[n.m.0]alkanes,
J. Am. Chem. Soc., 1970, 92, 3109-3118. [all data]
Huckel, Kamenz, et al., 1937
Huckel, W.; Kamenz, E.; Gross, A.; Tappe, W.,
Zur kenntnis der waldenschen umkehrung,
Ann. Chim., 1937, 533, 1-45. [all data]
Cox and Pilcher, 1970
Cox, J.D.; Pilcher, G.,
Thermochemistry of Organic and Organometallic Compounds, Academic Press, New York, 1970, 1-636. [all data]
Finke, McCullough, et al., 1972
Finke, H.L.; McCullough, J.P.; Messerly, J.F.; Osborn, A.; Douslin, D.R.,
cis- and trans-Hexahydroindan. Chemical thermodynamic properties and isomerization equilibrium,
J. Chem. Thermodyn., 1972, 4, 477-494. [all data]
Finke, McCullough, et al., 1972, 2
Finke, H.L.; McCullough, J.P.; Messerly, J.F.; Osborn, A.G.; Douslin, D.R.,
cis- and trans-Hexahydroindan. Chemical thermodynamic properties and isomerization equilibrium,
J. Chem. Thermodyn., 1972, 4, 477-94. [all data]
Anonymous, 1959
Anonymous, X.,
Unpublished, 1959, Bartlesville, OK 1959. [all data]
Stephenson and Malanowski, 1987
Stephenson, Richard M.; Malanowski, Stanislaw,
Handbook of the Thermodynamics of Organic Compounds, 1987, https://doi.org/10.1007/978-94-009-3173-2
. [all data]
Camin and Rossini, 1955
Camin, David L.; Rossini, Frederick D.,
Physical Properties of Fourteen API Research Hydrocarbons, C 9 to C 15,
J. Phys. Chem., 1955, 59, 11, 1173-1179, https://doi.org/10.1021/j150533a014
. [all data]
Blanchard and Schleyer, 1963
Blanchard, K.R.; Schleyer, P.,
Quantitative study of the interconversion of hydrindane isomers by aluminum bromide,
J. Org. Chem., 1963, 28, 247-248. [all data]
Allinger and Coke, 1960
Allinger, N.L.; Coke, J.L.,
The relative stabilities of cis and trans isomers. VII. The hydrindanes,
J. Am. Chem. Soc., 1960, 82, 2553-2556. [all data]
Dolliver, Gresham, et al., 1937
Dolliver, M.a.; Gresham, T.L.; Kistiakowsky, G.B.; Vaughan, W.E.,
Heats of organic reactions. V. Heats of hydrogenation of various hydrocarbons,
J. Am. Chem. Soc., 1937, 59, 831-841. [all data]
Mikaya and Zaikin, 1980
Mikaya, A.I.; Zaikin, V.G.,
Determination of the difference in enthalpies of formation of the cis- and trans-isomers of bicyclo[4.3.0]nonane and bicyclo[4.4.0]decane using appearance potentials,
Izv. Akad. Nauk SSSR, Ser. Khim., 1980, 6, 1286. [all data]
Natalis, 1963
Natalis, P.,
Etude du comportement d'isomeres geometriques sous l'impact electronique. II. Les cis et trans hexahydroindanes,
Bull. Soc. Chim. Belges, 1963, 72, 374. [all data]
Dallos, Sisak, et al., 2000
Dallos, A.; Sisak, A.; Kulcsár, Z.; Kováts, E.,
Pair-wise interactions by gas chromatography VII. Interaction free enthalpies of solutes with secondary alcohol groups,
J. Chromatogr. A, 2000, 904, 2, 211-242, https://doi.org/10.1016/S0021-9673(00)00908-0
. [all data]
Reddy, Dutoit, et al., 1992
Reddy, K.S.; Dutoit, J.-Cl.; Kovats, E. sz.,
Pair-wise interactions by gas chromatography. I. Interaction free enthalpies of solutes with non-associated primary alcohol groups,
J. Chromatogr., 1992, 609, 1-2, 229-259, https://doi.org/10.1016/0021-9673(92)80167-S
. [all data]
Tóth, 1983
Tóth, T.,
Use of capillary gas chromatography in collecting retention and chemical information for the analysis of complex petrochemical mixtures,
J. Chromatogr., 1983, 279, 157-165, https://doi.org/10.1016/S0021-9673(01)93614-3
. [all data]
Bredael, 1982
Bredael, P.,
Retention indices of hydrocarbons on SE-30,
J. Hi. Res. Chromatogr. Chromatogr. Comm., 1982, 5, 6, 325-328, https://doi.org/10.1002/jhrc.1240050610
. [all data]
Engewald, Epsch, et al., 1976
Engewald, W.; Epsch, K.; Welsch, Th.; Graefe, J.,
Molekülstruktur und Retentionsverhalten. VI. Retentionsverhalten von bicycle[n.m.0]alkanen bei der gas-adsorptions- und gas-verteilungs-chromatographie,
J. Chromatogr., 1976, 119, 119-128, https://doi.org/10.1016/S0021-9673(00)86776-X
. [all data]
Song, Lai, et al., 2003
Song, C.; Lai, W.-C.; Madhusudan Reddy, K.; Wei, B.,
Chapter 7. Temperature-programmed retention indices for GC and GC-MS of hydrocarbon fuels and simulated distillation GC of heavy oils
in Analytical advances for hydrocarbon research, Hsu,C.S., ed(s)., Kluwer Academic/Plenum Publishers, New York, 2003, 147-193. [all data]
Lai and Song, 1995
Lai, W.-C.; Song, C.,
Temperature-programmed retention indices for g.c. and g.c.-m.s. analysis of coal- and petroleum-derived liquid fuels,
Fuel, 1995, 74, 10, 1436-1451, https://doi.org/10.1016/0016-2361(95)00108-H
. [all data]
White, Hackett, et al., 1992
White, C.M.; Hackett, J.; Anderson, R.R.; Kail, S.; Spock, P.S.,
Linear temperature programmed retention indices of gasoline range hydrocarbons and chlorinated hydrocarbons on cross-linked polydimethylsiloxane,
J. Hi. Res. Chromatogr., 1992, 15, 2, 105-120, https://doi.org/10.1002/jhrc.1240150211
. [all data]
Ferrand, 1962
Ferrand, R.,
Gas phase chromatography using retention indices for the analysis of tars and their hydrogenation products,
Journees internationales d'etude des methodes de separation immediate at de chromatographie; Org. sur l'initiative du IX., 1962, 132-140. [all data]
Cornwell and Cordano, 2003
Cornwell, E.; Cordano, G.,
Nueva proposicion para predecir datos de retencion obtenidos mediante cromatografia de gases de hidrocarburos derivados de las naftas,
Revista de la Sociedad Quimica de Mexico, 2003, 47, 1, 38-43. [all data]
Waggott and Davies, 1984
Waggott, A.; Davies, I.W.,
Identification of organic pollutants using linear temperature programmed retention indices (LTPRIs) - Part II, 1984, retrieved from http://dwi.defra.gov.uk/research/completed-research/reports/dwi0383.pdf. [all data]