Phenol, 2-iodo-, 1-acetate
- Formula: C8H7IO2
- Molecular weight: 262.0445
- IUPAC Standard InChIKey: SNIVHZRVLQLTLY-UHFFFAOYSA-N
- CAS Registry Number: 32865-61-5
- Chemical structure:
View 3d structure (requires JavaScript / HTML 5) - Other names: 1-acetoxy-2-iodobenzene; Phenol,2-iodo-,acetate

Gas phase ion energetics data

Data compiled by: Sharon G. Lias, Rhoda D. Levin, and Sherif A. Kafafi
Ionization energy determinations
IE (eV) | Method | Reference |
---|---|---|
8.25 ± 0.03 | EI | Benezra and Bursey, 1971 |
Appearance energy determinations
Ion | AE (eV) | Other Products | Method | Reference | Comment |
---|---|---|---|---|---|
C2H3O+ | 12.47 ± 0.03 | C6H4IO | EI | Benezra and Bursey, 1971 | |
C6H5OI+ | 9.72 ± 0.03 | CH2=C=O | EI | Benezra and Bursey, 1971 |

References

Benezra and Bursey, 1971
Benezra, S.A.; Bursey, M.M.,
ortho-Effects on ordering factors in mass spectral rearrangements. Loss of keten from halogenated phenyl acetates and acetanilides,
J. Chem. Soc. B, 1971, 1515. [all data]