1,1'-Binaphthalene, 2,2'-dimethyl-
- Formula: C22H18
- Molecular weight: 282.3783
- IUPAC Standard InChIKey: KDHFKMDVFWYSPT-UHFFFAOYSA-N
- CAS Registry Number: 32834-84-7
- Chemical structure:
View 3d structure (requires JavaScript / HTML 5) - Other names: 1,1'-Binaphthyl, 2,2'-dimethyl-; 2,2'-Dimethyl-1,1'-binaphthyl

Gas phase ion energetics data

Data compiled by: Sharon G. Lias, Rhoda D. Levin, and Sherif A. Kafafi
Ionization energy determinations
IE (eV) | Method | Reference |
---|---|---|
8.20 ± 0.05 | EI | Loudon and Mazengo, 1974 |
8.20 | EI | Harris, Loudon, et al., 1971 |
Appearance energy determinations
Ion | AE (eV) | Other Products | Method | Reference | Comment |
---|---|---|---|---|---|
C21H15+ | 13.3 ± 0.2 | CH3 | EI | Loudon and Mazengo, 1974 | |
C21H15+ | 13.25 | CH3 | EI | Harris, Loudon, et al., 1971 |

References

Loudon and Mazengo, 1974
Loudon, A.G.; Mazengo, R.Z.,
Steric strain and electron-impact. The behaviour of some n, n'-dimethyl- 1,1-binaphthyls, some n, n'-dimethylbiphenyls and model compounds,
Org. Mass Spectrom., 1974, 8, 179. [all data]
Harris, Loudon, et al., 1971
Harris, M.M.; Loudon, A.G.; Mazengo, R.Z.,
Ring expansion reactions in aromatic systems. A study of steric strain in some n,n'-dimethyl-1,1'-binaphthyls,
Org. Mass Spectrom., 1971, 5, 1123. [all data]