Cyclohexene, 1-butyl-
- Formula: C10H18
- Molecular weight: 138.2499
- IUPAC Standard InChIKey: INNYVOGDZSDNIP-UHFFFAOYSA-N
- CAS Registry Number: 3282-53-9
- Chemical structure:
View 3d structure (requires JavaScript / HTML 5) - Other names: 1-Butyl-1-cyclohexene; 1-Butylcyclohexene

Phase change data

Data compiled by: Thermodynamics Research Center, NIST Boulder Laboratories, Chris Muzny director
Quantity | Value | Units | Method | Reference | Comment |
---|---|---|---|---|---|
Tboil | 452. | K | N/A | Benkeser, Arnold, et al., 1955 | Uncertainty assigned by TRC = 4. K |
Tboil | 455.0 | K | N/A | Signaigo and Cramer, 1933 | Uncertainty assigned by TRC = 4. K |

Gas phase ion energetics data

Data compiled by: Sharon G. Lias, Rhoda D. Levin, and Sherif A. Kafafi
Ionization energy determinations
IE (eV) | Method | Reference |
---|---|---|
8.41 ± 0.01 | PE | Rang, Paldoia, et al., 1974 |

Kovats' RI, non-polar column, isothermal

Column type | Active phase | Temperature (C) | I | Reference | Comment |
---|---|---|---|---|---|
Packed | Squalane | 60. | 1042. | Bogoslovsky, Anvaer, et al., 1978 | |
Packed | Squalane | 80. | 1047. | Bogoslovsky, Anvaer, et al., 1978 | |
Capillary | Squalane | 100. | 1050. | Rang, Orav, et al., 1977 | Nitrogen or helium; Column length: 100. m; Column diameter: 0.25 mm |
Capillary | Apiezon L | 100. | 1077. | Eisen, Orav, et al., 1972 | Column length: 45. m; Column diameter: 0.25 mm |
Capillary | Apiezon L | 120. | 1085. | Eisen, Orav, et al., 1972 | Column length: 45. m; Column diameter: 0.25 mm |
Capillary | Squalane | 60. | 1041.8 | Eisen, Orav, et al., 1972 | Column length: 80. m; Column diameter: 0.25 mm |
Capillary | Squalane | 80. | 1046.8 | Eisen, Orav, et al., 1972 | Column length: 80. m; Column diameter: 0.25 mm |
Capillary | Squalane | 60. | 1042. | Orav and Eisen, 1972 | Column length: 80. m; Column diameter: 0.25 mm |
Capillary | Squalane | 80. | 1047. | Orav and Eisen, 1972 | Column length: 80. m; Column diameter: 0.25 mm |

Kovats' RI, polar column, isothermal

Column type | Active phase | Temperature (C) | I | Reference | Comment |
---|---|---|---|---|---|
Capillary | PEG-20M | 80. | 1156.1 | Orav, Kuningas, et al., 1994 | 50. m/0.2 mm/0.13 μm, He |
Capillary | PEG-20M | 80. | 1163.5 | Orav, Kuningas, et al., 1994 | 50. m/0.2 mm/0.19 μm, He |
Capillary | PEG-20M | 80. | 1166.9 | Orav, Kuningas, et al., 1994 | 50. m/0.2 mm/0.22 μm, He |
Capillary | PEG 4000 | 100. | 1198. | Rang, Orav, et al., 1988 | |
Capillary | PEG 4000 | 110. | 1208. | Rang, Orav, et al., 1988 | |
Capillary | PEG 4000 | 120. | 1213. | Rang, Orav, et al., 1988 | |
Capillary | PEG 4000 | 60. | 1178. | Rang, Orav, et al., 1988 | |
Capillary | PEG 4000 | 80. | 1188. | Rang, Orav, et al., 1988 | |
Capillary | PEG-20M | 100. | 1183. | Rang, Orav, et al., 1988 | |
Capillary | PEG-20M | 110. | 1188. | Rang, Orav, et al., 1988 | |
Capillary | PEG-20M | 120. | 1193. | Rang, Orav, et al., 1988 | |
Capillary | PEG-20M | 130. | 1197. | Rang, Orav, et al., 1988 | |
Capillary | PEG-20M | 80. | 1172. | Rang, Orav, et al., 1988 | |
Capillary | PEG-20M | 90. | 1178. | Rang, Orav, et al., 1988 | |
Capillary | PEG-20M | 100. | 1182.7 | Orav, Kuningas, et al., 1982 | He; Column length: 100. m; Column diameter: 0.25 mm |
Capillary | PEG-20M | 110. | 1188. | Orav, Kuningas, et al., 1982 | He; Column length: 100. m; Column diameter: 0.25 mm |
Capillary | PEG-20M | 120. | 1192.7 | Orav, Kuningas, et al., 1982 | He; Column length: 100. m; Column diameter: 0.25 mm |
Capillary | PEG-20M | 130. | 1196.8 | Orav, Kuningas, et al., 1982 | He; Column length: 100. m; Column diameter: 0.25 mm |
Capillary | PEG-20M | 80. | 1172.3 | Orav, Kuningas, et al., 1982 | He; Column length: 100. m; Column diameter: 0.25 mm |
Capillary | PEG-20M | 90. | 1177.8 | Orav, Kuningas, et al., 1982 | He; Column length: 100. m; Column diameter: 0.25 mm |
Capillary | PEG 4000 | 100. | 1198. | Rang, Orav, et al., 1977 | Nitrogen or Helium; Column length: 45. m; Column diameter: 0.25 mm |
Capillary | Polyethylene Glycol 4000 | 100. | 1196.9 | Eisen, Orav, et al., 1972 | Column length: 80. m; Column diameter: 0.25 mm |
Capillary | Polyethylene Glycol 4000 | 60. | 1177.1 | Eisen, Orav, et al., 1972 | Column length: 80. m; Column diameter: 0.25 mm |
Capillary | Polyethylene Glycol 4000 | 80. | 1187.1 | Eisen, Orav, et al., 1972 | Column length: 80. m; Column diameter: 0.25 mm |
Capillary | PEG 4000 | 100. | 1196.9 | Orav and Eisen, 1972 | Column length: 80. m; Column diameter: 0.25 mm |
Capillary | PEG 4000 | 60. | 1177.1 | Orav and Eisen, 1972 | Column length: 80. m; Column diameter: 0.25 mm |
Capillary | PEG 4000 | 80. | 1187.1 | Orav and Eisen, 1972 | Column length: 80. m; Column diameter: 0.25 mm |

Normal alkane RI, non-polar column, temperature ramp

Column type | Active phase | I | Reference | Comment |
---|---|---|---|---|
Capillary | OV-101 | 1050. | Chupalov and Zenkevich, 1996 | N2, 3. K/min; Column length: 52. m; Column diameter: 0.26 mm; Tstart: 50. C; Tend: 220. C |
Capillary | SP-2100 | 1042. | Alencar, Alves, et al., 1983 | He, 4. K/min; Column length: 30. m; Column diameter: 0.25 mm; Tstart: 40. C; Tend: 250. C |

Normal alkane RI, non-polar column, custom temperature program

Column type | Active phase | I | Reference | Comment |
---|---|---|---|---|
Capillary | Squalane | 1042. | Chen, 2008 | Program: not specified |

References

Benkeser, Arnold, et al., 1955
Benkeser, R.A.; Arnold, C.; Lambert, R.F.; Thomas, O.H.,
Reduction of ORganic Compounds by Lithium in Low Molecular Weight Amines. III. Reduction of Aromatic Compounds Containing Functional Groups,
J. Am. Chem. Soc., 1955, 77, 6042. [all data]
Signaigo and Cramer, 1933
Signaigo, F.K.; Cramer, P.L.,
The preparation of some mono- and dialkylcylohexanes,
J. Am. Chem. Soc., 1933, 55, 3326-32. [all data]
Rang, Paldoia, et al., 1974
Rang, S.; Paldoia, P.; Talvari, A.,
Ionization potentials of unsaturated hydrocarbons. 2. Mono-substituted cyclopentenes and cyclohexenes,
Eesti. NSV Tead. Akad. Toim., 1974, 354. [all data]