η2-Etheneiron tetracarbonyl
- Formula: C6H4FeO4
- Molecular weight: 195.939
- CAS Registry Number: 32799-25-0

Gas phase thermochemistry data

Data compiled by: José A. Martinho Simões
Quantity | Value | Units | Method | Reference | Comment |
---|---|---|---|---|---|
ΔfH°gas | -540.3 ± 9.3 | kJ/mol | Review | Martinho Simões | Selected data |
ΔfH°gas | -533.2 | kJ/mol | Review | Martinho Simões |

Condensed phase thermochemistry data

Data compiled by: José A. Martinho Simões
Quantity | Value | Units | Method | Reference | Comment |
---|---|---|---|---|---|
ΔfH°liquid | -582.1 ± 8.4 | kJ/mol | Review | Martinho Simões | Selected data |
ΔfH°liquid | -575.0 | kJ/mol | Review | Martinho Simões |

Gas phase ion energetics data

Data compiled as indicated in comments:
LLK - Sharon G. Lias, Rhoda D. Levin, and Sherif A. Kafafi
Ionization energy determinations
IE (eV) | Method | Reference | Comment |
---|---|---|---|
8.38 | PE | Van Dam and Oskam, 1979 | Vertical value; LLK |
8.4 | PE | Baerends, Oudshoorn, et al., 1975 | Vertical value; LLK |

Phase change data

Data compiled by: José A. Martinho Simões
Quantity | Value | Units | Method | Reference | Comment |
---|---|---|---|---|---|
ΔvapH° | 41.8 ± 4.0 | kJ/mol | HAL-HFC | Brown, Connor, et al., 1976 |

Reaction thermochemistry data

Data compiled by: José A. Martinho Simões
Individual Reactions
C6H4FeO4 (l) = 4 (g) +
(cr) +
(g)
By formula: C6H4FeO4 (l) = 4CO (g) + Fe (cr) + C2H4 (g)
Quantity | Value | Units | Method | Reference | Comment |
---|---|---|---|---|---|
ΔrH° | 192.5 ± 8.4 | kJ/mol | HAL-HFC | Brown, Connor, et al., 1976 | |
ΔrH° | 185.4 | kJ/mol | TD-HFC | Brown, Connor, et al., 1976 |

References

Martinho Simões
Martinho Simões, J.A.,
Private communication (see http://webbook.nist.gov/chemistry/om/). [all data]
Van Dam and Oskam, 1979
Van Dam, H.; Oskam, A.,
A remeasurement of the UV photoelectron spectrum of Fe(CO)4 ethylene,
J. Electron Spectrosc. Relat. Phenom., 1979, 17, 357. [all data]
Baerends, Oudshoorn, et al., 1975
Baerends, E.J.; Oudshoorn, Ch.; Oskam, A.,
Photoelectron spectra and Xα calculations of iron pentacarbonyl and ethyleneiron tetracarbonyl,
J. Electron Spectrosc. Relat. Phenom., 1975, 6, 259. [all data]