o-Xylylene
- Formula: C8H8
- Molecular weight: 104.1491
- IUPAC Standard InChIKey: XURVRZSODRHRNK-UHFFFAOYSA-N
- CAS Registry Number: 32796-95-5
- Chemical structure:
View 3d structure (requires JavaScript / HTML 5) - Species with the same structure:

Gas phase thermochemistry data

Data compiled by: Hussein Y. Afeefy, Joel F. Liebman, and Stephen E. Stein
Quantity | Value | Units | Method | Reference | Comment |
---|---|---|---|---|---|
ΔfH°gas | 220. ± 20. | kJ/mol | Ion | Pollack, Raine, et al., 1981 | |
ΔfH°gas | 254. | kJ/mol | Kin | Roth and Scholz, 1981 |

Reaction thermochemistry data

Data compiled by: Hussein Y. Afeefy, Joel F. Liebman, and Stephen E. Stein
Individual Reactions
By formula: C8H8 = C8H8
Quantity | Value | Units | Method | Reference | Comment |
---|---|---|---|---|---|
ΔrH° | -54.8 | kJ/mol | Kin | Roth and Scholz, 1981 | gas phase |
ΔrH° | -44.2 ± 1.9 | kJ/mol | Cm | Roth, Biermann, et al., 1978 | liquid phase |
By formula: C8H8 = C8H8
Quantity | Value | Units | Method | Reference | Comment |
---|---|---|---|---|---|
ΔrH° | 46.4 ± 0.8 | kJ/mol | Eqk | Roth, Ebbrecht, et al., 1988 | gas phase |

Gas phase ion energetics data

Data evaluated by: Edward P. Hunter and Sharon G. Lias
Quantity | Value | Units | Method | Reference | Comment |
---|---|---|---|---|---|
Proton affinity (review) | 898.8 | kJ/mol | N/A | Hunter and Lias, 1998 | |
Quantity | Value | Units | Method | Reference | Comment |
Gas basicity | 871.7 | kJ/mol | N/A | Hunter and Lias, 1998 |

Vibrational and/or electronic energy levels

Data compiled by: Marilyn E. Jacox
State: ?
Energy (cm-1) |
Med. | Transition | λmin (nm) |
λmax (nm) |
References | ||
---|---|---|---|---|---|---|---|
Ar | 326 | 403 | Tseng and Michl, 1977 | ||||
McMahon and Chapman, 1987 | |||||||
Chapman, Johnson, et al., 1988 | |||||||
State: X
Additional references: Jacox, 1994, page 396

References

Pollack, Raine, et al., 1981
Pollack, S.K.; Raine, B.C.; Hehre, W.J.,
Determination of the heats of formation of the isomeric xylylenes by ion cyclotron double-resonance spectroscopy,
J. Am. Chem. Soc., 1981, 103, 6308-6313. [all data]
Roth and Scholz, 1981
Roth, W.R.; Scholz, B.P.,
Energy profile of the o-quinodimethane = benzocyclobutene equilibrium. Part 2.,
Chem. Ber., 1981, 114, 3741-3750. [all data]
Roth, Biermann, et al., 1978
Roth, W.R.; Biermann, M.; Dekker, H.; Jochems, R.; Mosselman, C.; Hermann, H.,
Energy profile of the o-quinodimethane-benzocyclobutene equilibrium,
Chem. Ber., 1978, 111, 3892-3903. [all data]
Roth, Ebbrecht, et al., 1988
Roth, W.R.; Ebbrecht, T.; Beitat, A.,
o-Quinodimethane-benzocyclobutene equilibrium: oxygen trapping technique,
Chem. Ber., 1988, 121, 1357-1358. [all data]
Hunter and Lias, 1998
Hunter, E.P.; Lias, S.G.,
Evaluated Gas Phase Basicities and Proton Affinities of Molecules: An Update,
J. Phys. Chem. Ref. Data, 1998, 27, 3, 413-656, https://doi.org/10.1063/1.556018
. [all data]
Tseng and Michl, 1977
Tseng, K.L.; Michl, J.,
An approach to biradical-like species. Spectroscopy of o-xylylene in argon matrix,
J. Am. Chem. Soc., 1977, 99, 14, 4840, https://doi.org/10.1021/ja00456a059
. [all data]
McMahon and Chapman, 1987
McMahon, R.J.; Chapman, O.L.,
Direct spectroscopic observation of intramolecular hydrogen shifts in carbenes,
J. Am. Chem. Soc., 1987, 109, 3, 683, https://doi.org/10.1021/ja00237a008
. [all data]
Chapman, Johnson, et al., 1988
Chapman, O.L.; Johnson, J.W.; McMahon, R.J.; West, P.R.,
Rearrangements of the isomeric tolylmethylenes,
J. Am. Chem. Soc., 1988, 110, 2, 501, https://doi.org/10.1021/ja00210a032
. [all data]
Jacox, 1994
Jacox, M.E.,
Vibrational and electronic energy levels of polyatomic transient molecules, American Chemical Society, Washington, DC, 1994, 464. [all data]