4,7-Methano-1H-indene,5-ethyloctahydro-,(3aα,4β,5α,7β,7aα)-
- Formula: C12H20
- Molecular weight: 164.2872
- IUPAC Standard InChIKey: USWHQIMHJXIDKG-UHFFFAOYSA-N
- CAS Registry Number: 32787-97-6
- Chemical structure:
View 3d structure (requires JavaScript / HTML 5) - Other names: 4,7-Methano-1H-indene,5-ethyloctahydro-,(3aα,4β,5α,7β,7aα)-

Gas phase ion energetics data

Data compiled by: Sharon G. Lias, Rhoda D. Levin, and Sherif A. Kafafi
Ionization energy determinations
IE (eV) | Method | Reference |
---|---|---|
9.35 ± 0.05 | PI | Fedorova, Denisov, et al., 1973 |
Appearance energy determinations
Ion | AE (eV) | Other Products | Method | Reference | Comment |
---|---|---|---|---|---|
C5H7+ | >10.2 ± 0.1 | ? | PI | Fedorova, Denisov, et al., 1973 | |
C6H9+ | ≤10.2 ± 0.1 | ? | PI | Fedorova, Denisov, et al., 1973 | |
C7H11+ | ≤10.2 ± 0.1 | ? | PI | Fedorova, Denisov, et al., 1973 | |
C8H11+ | 9.9 ± 0.1 | ? | PI | Fedorova, Denisov, et al., 1973 | |
C9H13+ | 9.9 ± 0.1 | ? | PI | Fedorova, Denisov, et al., 1973 | |
C10H15+ | 9.9 ± 0.1 | ? | PI | Fedorova, Denisov, et al., 1973 | |
C11H17+ | 10.0 ± 0.1 | CH3 | PI | Fedorova, Denisov, et al., 1973 |

References

Fedorova, Denisov, et al., 1973
Fedorova, M.S.; Denisov, Y.V.; Poptapov, V.K.,
Mass-spectrometric study of the photoionisation processes of tricyclo[5,2,1,02,6] decane and its alkyl derivatives,
Russ. J. Phys. Chem., 1973, 47, 1498. [all data]