trans-5-Methyl-1,3-hexadiene
- Formula: C7H12
- Molecular weight: 96.1702
- IUPAC Standard InChIKey: HQLSCIPCIFAMOK-AATRIKPKSA-N
- CAS Registry Number: 32763-70-5
- Chemical structure:
View 3d structure (requires JavaScript / HTML 5) - Permanent link for this species. Use this link for bookmarking this species for future reference.

Gas phase ion energetics data

Data compiled as indicated in comments:
LLK - Sharon G. Lias, Rhoda D. Levin, and Sherif A. Kafafi
Ionization energy determinations
IE (eV) | Method | Reference | Comment |
---|---|---|---|
8.47 | PE | Masclet, Mouvier, et al., 1981 | Vertical value; LLK |

References

Masclet, Mouvier, et al., 1981
Masclet, P.; Mouvier, G.; Bocquet, J.F.,
Effets electroniques et effets steriques dus a la substitution alcoyle dans les dienes conjugues,
J. Chim. Phys., 1981, 78, 99. [all data]