titanium tetrakis(dimethylammonium)
- Formula: C8H24N4Ti
- Molecular weight: 224.170
- CAS Registry Number: 3275-24-9

Condensed phase thermochemistry data

Data compiled by: José A. Martinho Simões
Quantity | Value | Units | Method | Reference | Comment |
---|---|---|---|---|---|
ΔfH°liquid | -460. ± 110. | kJ/mol | Review | Martinho Simões | |
ΔfH°liquid | -268.8 ± 7.1 | kJ/mol | Review | Martinho Simões | The enthalpy of formation relies on -1579.0 ± 3.9 kJ/mol for the enthalpy of formation of Ti(O-i-Pr)4(l) |
Quantity | Value | Units | Method | Reference | Comment |
ΔcH°liquid | -7070. ± 110. | kJ/mol | CC-SB | Makhailov, Baev, et al., 1986 |

Phase change data

Data compiled as indicated in comments:
MS - José A. Martinho Simões
AC - William E. Acree, Jr., James S. Chickos
Quantity | Value | Units | Method | Reference | Comment |
---|---|---|---|---|---|
ΔvapH° | 58.6 ± 8.4 | kJ/mol | CC-SB | Lappert, Patil, et al., 1975 | MS |
Enthalpy of vaporization
ΔvapH (kJ/mol) | Temperature (K) | Reference | Comment |
---|---|---|---|
53.8 ± 3.0 | 383. | Baev, Mikhailov, et al., 1984 | Based on data from 353. to 418. K. See also Baev and Mikhailov, 2001.; AC |

Gas phase ion energetics data

Data compiled by: Sharon G. Lias, Rhoda D. Levin, and Sherif A. Kafafi
Ionization energy determinations
IE (eV) | Method | Reference | Comment |
---|---|---|---|
7.13 | PE | Gibbins, Lappert, et al., 1975 | Vertical value |

Gas phase thermochemistry data

Data compiled by: José A. Martinho Simões
Quantity | Value | Units | Method | Reference | Comment |
---|---|---|---|---|---|
ΔfH°gas | -400. ± 110. | kJ/mol | Review | Martinho Simões | |
ΔfH°gas | -210. ± 11. | kJ/mol | Review | Martinho Simões | The enthalpy of formation relies on -1579.0 ± 3.9 kJ/mol for the enthalpy of formation of Ti(O-i-Pr)4(l) |

References

Martinho Simões
Martinho Simões, J.A.,
Private communication (see http://webbook.nist.gov/chemistry/om/). [all data]
Makhailov, Baev, et al., 1986
Makhailov, V.E.; Baev, A.K.; Sachek, A.I.; Al'khimovich, V.M.,
Zh. Fiz. Khim., 1986, 60, 2306. [all data]
Lappert, Patil, et al., 1975
Lappert, M.F.; Patil, D.S.; Pedley, J.B.,
J. Chem. Soc., Chem. Commun., 1975, 830.. [all data]
Baev, Mikhailov, et al., 1984
Baev, A.K.; Mikhailov, V.E.; Baev, A.A.,
Vestsi Akad. Navuk BSSR Ser. Khim. Navuk, 1984, 75. [all data]
Baev and Mikhailov, 2001
Baev, A.K.; Mikhailov, V.E.,
Russian Journal of Applied Chemistry, 2001, 74, 9, 1435-1438, https://doi.org/10.1023/A:1013772227611
. [all data]
Gibbins, Lappert, et al., 1975
Gibbins, S.G.; Lappert, M.F.; Pedley, J.B.; Sharp, G.J.,
Bonding studies of transition-metal complexes. Part II. Helium-I photoelectron spectra of homoleptic d0, d1, and d10 tetrakis(dialkylamides) of transition group 4B metals tungsten hexakis(dimethylamide),
J. Chem. Soc. Dalton Trans., 1975, 72. [all data]