Distannane
- Formula: H6Sn2
- Molecular weight: 243.468
- IUPAC Standard InChIKey: HKQRRHRYNOJZBA-UHFFFAOYSA-N
- CAS Registry Number: 32745-15-6
- Chemical structure:
View 3d structure (requires JavaScript / HTML 5) - Permanent link for this species. Use this link for bookmarking this species for future reference.

Gas phase ion energetics data

Data compiled by: Henry M. Rosenstock, Keith Draxl, Bruce W. Steiner, and John T. Herron
Ionization energy determinations
IE (eV) | Method | Reference |
---|---|---|
9.0 ± 0.3 | El | Saalfeld and Svec, 1963 |
Appearance energy determinations
Ion | AE (eV) | Other Products | Method | Reference | Comment |
---|---|---|---|---|---|
Sn2H+ | 10.6 ± 0.3 | 2H2+H | EI | Saalfeld and Svec, 1963 | |
Sn2H2+ | 10.5 ± 0.3 | 2H2 | EI | Saalfeld and Svec, 1963 | |
Sn2H4+ | 10.3 ± 0.3 | H2 | El | Saalfeld and Svec, 1963 | |
Sn2H5+ | 10.0 ± 0.3 | H | EI | Saalfeld and Svec, 1963 | |
Sn+ | 10.8 ± 0.3 | ? | EI | Saalfeld and Svec, 1963 | |
Sn2+ | 10.7 ± 0.3 | 3H2 | EI | Saalfeld and Svec, 1963 |

References

Saalfeld and Svec, 1963
Saalfeld, F.E.; Svec, H.J.,
The mass spectra of volatile hydrides. II. Some higher hydrides of the group IVB and VB elements,
Inorg. Chem., 1963, 2, 50. [all data]