Phosphorane, trimethyl[(trimethylsilyl)methylene]-
- Formula: C7H19PSi
- Molecular weight: 162.2850
- IUPAC Standard InChIKey: DRCZAXUICNOCSX-UHFFFAOYSA-N
- CAS Registry Number: 3272-86-4
- Chemical structure:
View 3d structure (requires JavaScript / HTML 5) - Permanent link for this species. Use this link for bookmarking this species for future reference.

Gas phase ion energetics data

Data compiled by: Sharon G. Lias, Rhoda D. Levin, and Sherif A. Kafafi
Ionization energy determinations
IE (eV) | Method | Reference | Comment |
---|---|---|---|
6.80 | PE | Schmidbaur and Vornberger, 1972 | |
6.81 | PE | Starzewski, Richter, et al., 1976 | Vertical value |
6.81 | PE | Starzewski, Dieck, et al., 1974 | Vertical value |

References

Schmidbaur and Vornberger, 1972
Schmidbaur, H.; Vornberger, W.,
Die organosiliciumchemie der phosphor-ylid XVI. Si-Si-struktureinheiten als carbanion-substituenten in yliden,
Chem. Ber., 1972, 105, 3173. [all data]
Starzewski, Richter, et al., 1976
Starzewski, K.-H.A.O.; Richter, W.; Schmidbaur, H.,
Photoelektronenspektren und Struktur von Arsenyliden. P versus As: Ein Beitrag zur Problematik der ylidischen Bindung,
Chem. Ber., 1976, 109, 473. [all data]
Starzewski, Dieck, et al., 1974
Starzewski, K.A.O.; Dieck, H.T.; Bock, H.,
Photoelectron spectra molecular properties. XXIII. Photoelectron spectra of silicon-substituted ylidic systems,
J. Organomet. Chem., 1974, 65, 311. [all data]