1,1'-Binaphthalene, 8,8'-dimethyl-
- Formula: C22H18
- Molecular weight: 282.3783
- IUPAC Standard InChIKey: SMWBLXLBHDDWCQ-UHFFFAOYSA-N
- CAS Registry Number: 32693-05-3
- Chemical structure:
View 3d structure (requires JavaScript / HTML 5) - Other names: 1,1'-Binaphthyl, 8,8'-dimethyl-; 8,8'-Dimethyl-1,1'-binaphthyl

Gas phase ion energetics data

Data compiled by: Sharon G. Lias, Rhoda D. Levin, and Sherif A. Kafafi
Ionization energy determinations
IE (eV) | Method | Reference |
---|---|---|
8.00 ± 0.05 | EI | Loudon and Mazengo, 1974 |
8.00 | EI | Harris, Loudon, et al., 1971 |
Appearance energy determinations
Ion | AE (eV) | Other Products | Method | Reference | Comment |
---|---|---|---|---|---|
C21H15+ | 11.5 ± 0.2 | CH3 | EI | Loudon and Mazengo, 1974 | |
C21H15+ | 11.50 | CH3 | EI | Harris, Loudon, et al., 1971 |

References

Loudon and Mazengo, 1974
Loudon, A.G.; Mazengo, R.Z.,
Steric strain and electron-impact. The behaviour of some n, n'-dimethyl- 1,1-binaphthyls, some n, n'-dimethylbiphenyls and model compounds,
Org. Mass Spectrom., 1974, 8, 179. [all data]
Harris, Loudon, et al., 1971
Harris, M.M.; Loudon, A.G.; Mazengo, R.Z.,
Ring expansion reactions in aromatic systems. A study of steric strain in some n,n'-dimethyl-1,1'-binaphthyls,
Org. Mass Spectrom., 1971, 5, 1123. [all data]