Chloromethyl thiocyanate
- Formula: C2H2ClNS
- Molecular weight: 107.562
- IUPAC Standard InChIKey: UXUCVNXUWOLPRU-UHFFFAOYSA-N
- CAS Registry Number: 3268-79-9
- Chemical structure:
View 3d structure (requires JavaScript / HTML 5) - Other names: Thiocyanic acid chloromethyl ester; Chloromethylthiocyanogen

Phase change data

Data compiled by: Robert L. Brown and Stephen E. Stein
Quantity | Value | Units | Method | Reference | Comment |
---|---|---|---|---|---|
Tboil | 458.2 | K | N/A | Weast and Grasselli, 1989 |
Reduced pressure boiling point
Tboil (K) | Pressure (bar) | Reference |
---|---|---|
350.2 | 0.020 | Aldrich Chemical Company Inc., 1990 |

Gas phase ion energetics data

Data compiled by: Sharon G. Lias, John E. Bartmess, Joel F. Liebman, John L. Holmes, Rhoda D. Levin, and W. Gary Mallard
Ionization energy determinations
IE (eV) | Method | Reference |
---|---|---|
10.29 | PE | Molder, Pikver, et al., 1983 |

References

Weast and Grasselli, 1989
CRC Handbook of Data on Organic Compounds, 2nd Editon, Weast,R.C and Grasselli, J.G., ed(s)., CRC Press, Inc., Boca Raton, FL, 1989, 1. [all data]
Aldrich Chemical Company Inc., 1990
Aldrich Chemical Company Inc.,
Catalog Handbook of Fine Chemicals, Aldrich Chemical Company, Inc., Milwaukee WI, 1990, 1. [all data]
Molder, Pikver, et al., 1983
Molder, U.H.; Pikver, R.J.; Koppel, I.A.,
Photoelectron spectra of molecules. 3. Nitriles,
Org. React. Tartu, 1983, 20, 230. [all data]