4-Stilbene carboxaldehyde
- Formula: C15H12O
- Molecular weight: 208.2552
- IUPAC Standard InChIKey: CLXSBHRRZNBTRT-VOTSOKGWSA-N
- CAS Registry Number: 32555-96-7
- Chemical structure:
View 3d structure (requires JavaScript / HTML 5) - Other names: Benzaldehyde,4-(2-phenylethenyl)-

Gas phase ion energetics data

Data compiled by: Sharon G. Lias, Rhoda D. Levin, and Sherif A. Kafafi
Ionization energy determinations
IE (eV) | Method | Reference |
---|---|---|
7.92 ± 0.04 | PI | Potapov, Kardash, et al., 1972 |

References

Potapov, Kardash, et al., 1972
Potapov, V.K.; Kardash, I.E.; Sorokin, V.V.; Sokolov, S.A.; Evlasheva, T.I.,
Photoionization of heteroaromatic compounds,
Khim. Vys. Energ., 1972, 6, 392. [all data]