2,2,2-Trifluoroethyl radical
- Formula: C2H2F3
- Molecular weight: 83.0325
- IUPAC Standard InChIKey: COLOHWPRNRVWPI-UHFFFAOYSA-N
- CAS Registry Number: 3248-58-6
- Chemical structure:
View 3d structure (requires JavaScript / HTML 5) - Permanent link for this species. Use this link for bookmarking this species for future reference.

Gas phase ion energetics data

Data compiled as indicated in comments:
RDSH - Henry M. Rosenstock, Keith Draxl, Bruce W. Steiner, and John T. Herron
Ionization energy determinations
IE (eV) | Method | Reference | Comment |
---|---|---|---|
10.6 ± 0.1 | EI | Fisher, Homer, et al., 1965 | RDSH |

References

Fisher, Homer, et al., 1965
Fisher, I.P.; Homer, J.B.; Lossing, F.P.,
Free radicals by mass spectrometry. XXXIII. Ionization potentials of CF2, CF3CF2, CF3CH2, n-C3F7, and i-C3F7 radicals,
J. Am. Chem. Soc., 1965, 87, 957. [all data]