1,1'-Biphenyl, 4-fluoro-
- Formula: C12H9F
- Molecular weight: 172.1983
- IUPAC Standard InChIKey: RUYZJEIKQYLEGZ-UHFFFAOYSA-N
- CAS Registry Number: 324-74-3
- Chemical structure:
View 3d structure (requires JavaScript / HTML 5) - Other names: Biphenyl, 4-fluoro-; p-Fluorodiphenyl; 4-Fluorobiphenyl; p-Fluorobiphenyl; Fluorobiphenyl

Phase change data

Data compiled by: Robert L. Brown and Stephen E. Stein
Quantity | Value | Units | Method | Reference | Comment |
---|---|---|---|---|---|
Tboil | 583.2 | K | N/A | Aldrich Chemical Company Inc., 1990 | |
Tboil | 583. | K | N/A | PCR Inc., 1990 |

Gas phase ion energetics data

Data compiled as indicated in comments:
LLK - Sharon G. Lias, Rhoda D. Levin, and Sherif A. Kafafi
Ionization energy determinations
IE (eV) | Method | Reference | Comment |
---|---|---|---|
8.00 ± 0.02 | PE | Maier and Turner, 1972 | LLK |

Normal alkane RI, non-polar column, temperature ramp

Column type | Active phase | I | Reference | Comment |
---|---|---|---|---|
Capillary | PB-1 | 1357. | Andersson and Weis, 1994 | 50. m/0.32 mm/0.2 μm, H2, 80. C @ 2. min, 4. K/min, 270. C @ 5. min |
Capillary | DB-5 | 1357. | Andersson and Weis, 1994 | 30. m/0.32 mm/0.25 μm, H2, 80. C @ 2. min, 4. K/min, 270. C @ 5. min |

Lee's RI, non-polar column, temperature ramp

Column type | Active phase | I | Reference | Comment |
---|---|---|---|---|
Capillary | PB-1 | 233.89 | Andersson and Weis, 1994 | 50. m/0.32 mm/0.2 μm, H2, 80. C @ 2. min, 4. K/min, 270. C @ 5. min |
Capillary | DB-5 | 233.59 | Andersson and Weis, 1994 | 30. m/0.32 mm/0.25 μm, H2, 80. C @ 2. min, 4. K/min, 270. C @ 5. min |
Lee's RI, polar column, temperature ramp
Column type | Active phase | I | Reference | Comment |
---|---|---|---|---|
Capillary | DB-Wax | 230.04 | Andersson and Weis, 1994 | 30. m/0.2 mm/0.15 μm, H2, 80. C @ 2. min, 4. K/min, 270. C @ 5. min |

References

Aldrich Chemical Company Inc., 1990
Aldrich Chemical Company Inc.,
Catalog Handbook of Fine Chemicals, Aldrich Chemical Company, Inc., Milwaukee WI, 1990, 1. [all data]
PCR Inc., 1990
PCR Inc.,
Research Chemicals Catalog 1990-1991, PCR Inc., Gainesville, FL, 1990, 1. [all data]
Maier and Turner, 1972
Maier, J.P.; Turner, D.W.,
Steric inhibition of resonance studied by molecular photoelectron spectroscopy. Part I. Biphenyls,
Faraday Discuss. Chem. Soc., 1972, 54, 149. [all data]
Andersson and Weis, 1994
Andersson, J.T.; Weis, U.,
Gas Chromatographic Determination of Polycyclic Aromatic Compounds with Fluorinated Analogues as Internal Standards,
J. Chromatogr. A, 1994, 659, 1, 151-161, https://doi.org/10.1016/0021-9673(94)85017-8
. [all data]