(Z)-2,4-Hexadiene, 2,3-dimethyl-
- Formula: C8H14
- Molecular weight: 110.1968
- IUPAC Standard InChIKey: XPQJKTHTVOZXGD-WAYWQWQTSA-N
- CAS Registry Number: 32461-38-4
- Chemical structure:
View 3d structure (requires JavaScript / HTML 5) - Stereoisomers:

Gas phase ion energetics data

Data compiled by: Sharon G. Lias and Joel F. Liebman
Ionization energy determinations
IE (eV) | Method | Reference | Comment |
---|---|---|---|
7.9 | PE | Werstiuk, Clark, et al., 1990 | |
8.13 | PE | Werstiuk, Clark, et al., 1990 | Vertical value |

References

Werstiuk, Clark, et al., 1990
Werstiuk, N.H.; Clark, K.B.; Leigh, W.J.,
Conformational analysis and structure elucidation of 2,3-dimethyl and 2,4-dimethyl-2,4-hexadienes by AM1 and He(I) ultraviolet photoelectron spectroscopy,
Can. J. Chem., 1990, 68, 2078. [all data]