5-Hexen-2-one, 5-methyl-
- Formula: C7H12O
- Molecular weight: 112.1696
- IUPAC Standard InChIKey: VBCIOOKAKHGVMI-UHFFFAOYSA-N
- CAS Registry Number: 3240-09-3
- Chemical structure:
View 3d structure (requires JavaScript / HTML 5) - Other names: 5-Methyl-5-hexen-2-one; 2-Methyl-1-hexene-5-one; 5-methylhex-5-en-2-one

Phase change data

Data compiled by: Robert L. Brown and Stephen E. Stein
Quantity | Value | Units | Method | Reference | Comment |
---|---|---|---|---|---|
Tboil | 421.7 | K | N/A | Aldrich Chemical Company Inc., 1990 | |
Tboil | 421. to 423. | K | N/A | Frinton Laboratories Inc., 1986 |

Gas phase ion energetics data

Data compiled by: Sharon G. Lias, Rhoda D. Levin, and Sherif A. Kafafi
Ionization energy determinations
IE (eV) | Method | Reference | Comment |
---|---|---|---|
9.40 | PE | Schweig, Vermeer, et al., 1974 | Vertical value |

Van Den Dool and Kratz RI, polar column, custom temperature program

Column type | Active phase | I | Reference | Comment |
---|---|---|---|---|
Capillary | CP-Wax 52CB | 1300. | Alasalvar, Shahidi, et al., 2003 | 60. m/0.25 mm/0.25 μm, He; Program: 40C => 5C/min => 60C => 2.5C/min => 155C |

Normal alkane RI, non-polar column, temperature ramp

Column type | Active phase | I | Reference | Comment |
---|---|---|---|---|
Capillary | DB-1 | 792. | Tai and Ho, 1998 | 60. m/0.32 mm/1.0 μm, He, 2. K/min; Tstart: 40. C; Tend: 280. C |
Capillary | DB-1 | 813. | Yu, Wu, et al., 1994 | 60. m/0.25 mm/1. μm, He, 40. C @ 5. min, 2. K/min, 260. C @ 60. min |

References

Aldrich Chemical Company Inc., 1990
Aldrich Chemical Company Inc.,
Catalog Handbook of Fine Chemicals, Aldrich Chemical Company, Inc., Milwaukee WI, 1990, 1. [all data]
Frinton Laboratories Inc., 1986
Frinton Laboratories Inc.,
Catalog Number 11, Frinton Laboratories Inc., Vineland, NJ, 1986, 99. [all data]
Schweig, Vermeer, et al., 1974
Schweig, A.; Vermeer, H.; Weidner, U.,
A photoelectron spectroscopic study of keto-enol tautomerism in acetylacetones - a new application of photoelectron spectroscopy,
Chem. Phys. Lett., 1974, 26, 229. [all data]
Alasalvar, Shahidi, et al., 2003
Alasalvar, C.; Shahidi, F.; Cadwallader, K.R.,
Comparison of natural and roasted Turkish Tombul hazelnut (Corylus avellana L.) volatiles and flavor by DHA/GC/MS and descriptive sensory analysis,
J. Agric. Food Chem., 2003, 51, 17, 5067-5072, https://doi.org/10.1021/jf0300846
. [all data]
Tai and Ho, 1998
Tai, C.-Y.; Ho, C.-T.,
Influence of glutathione oxidation and pH on thermal formation of Maillard-type volatile compounds,
J. Agric. Food Chem., 1998, 46, 6, 2260-2265, https://doi.org/10.1021/jf971111t
. [all data]
Yu, Wu, et al., 1994
Yu, T.-H.; Wu, C.-M.; Ho, C.-T.,
Volatile compounds generated from the thermal interaction of glucose and alliin or deoxyalliin in propylene glycol,
Food Chem., 1994, 51, 3, 281-286, https://doi.org/10.1016/0308-8146(94)90028-0
. [all data]