Cyclobutane,tetrakis(methylene)-
- Formula: C8H8
- Molecular weight: 104.1491
- IUPAC Standard InChIKey: GSMUOFYVMIBBMK-UHFFFAOYSA-N
- CAS Registry Number: 3227-91-6
- Chemical structure:
View 3d structure (requires JavaScript / HTML 5) - Permanent link for this species. Use this link for bookmarking this species for future reference.

Gas phase ion energetics data

Data compiled by: Sharon G. Lias, Rhoda D. Levin, and Sherif A. Kafafi
Ionization energy determinations
IE (eV) | Method | Reference |
---|---|---|
8.35 | PE | Bally, Buser, et al., 1978 |

References

Bally, Buser, et al., 1978
Bally, T.; Buser, U.; Haselbach, E.L.,
Tetrakis(methylidene)cyclobutane(`[4]radialene'): Electronic states of the molecular ion,
Helv. Chim. Acta, 1978, 61, 38. [all data]