1-Chloropropadiene
- Formula: C3H3Cl
- Molecular weight: 74.509
- IUPAC Standard InChIKey: MUDYCSPLOKOTRJ-UHFFFAOYSA-N
- CAS Registry Number: 3223-70-9
- Chemical structure:
View 3d structure (requires JavaScript / HTML 5) - Permanent link for this species. Use this link for bookmarking this species for future reference.

Gas phase ion energetics data

Data compiled by: Sharon G. Lias, Rhoda D. Levin, and Sherif A. Kafafi
Ionization energy determinations
IE (eV) | Method | Reference | Comment |
---|---|---|---|
9.57 | PE | Kroner, Kosbahn, et al., 1977 | Vertical value |

References

Kroner, Kosbahn, et al., 1977
Kroner, J.; Kosbahn, W.; Runge, W.,
The molecular structure of allenes and ketenes, IX[1]π and σ interactions in allenes: Photoelectron spectra, electronic absorption spectra, and quantum chemical calculations,
Ber. Bunsen-Ges. Phys. Chem., 1977, 81, 826. [all data]
Kroner, et al., 1977
Kroner, J., et al.,
Ber. Bunsen-Gesellschaft Ph. Chem., 1977, 81, 826. [all data]