[1,1'-Biphenyl]-4-carboxaldehyde
- Formula: C13H10O
- Molecular weight: 182.2179
- IUPAC Standard InChIKey: ISDBWOPVZKNQDW-UHFFFAOYSA-N
- CAS Registry Number: 3218-36-8
- Chemical structure:
View 3d structure (requires JavaScript / HTML 5) - Other names: 4-Biphenylcarboxaldehyde; p-Biphenylcarboxaldehyde; p-Biphenylylaldehyde; p-Phenylbenzaldehyde; Biphenyl-4-carboxaldehyde; 4-Biphenylaldehyde; 4-Biphenylylcarboxaldehyde; 4-Phenylbenzaldehyde; 4-Biphenylcarboxyaldehyde; p-Biphenylaldehyde; 4-Formylbiphenyl; 4-Formyl-1,1'-biphenyl; NSC 46066; Benzaldehyde, p-phenyl-

Phase change data

Data compiled by: Robert L. Brown and Stephen E. Stein
Reduced pressure boiling point
Tboil (K) | Pressure (bar) | Reference |
---|---|---|
457.2 | 0.015 | Aldrich Chemical Company Inc., 1990 |

Gas phase ion energetics data

Data compiled as indicated in comments:
LLK - Sharon G. Lias, Rhoda D. Levin, and Sherif A. Kafafi
Ionization energy determinations
IE (eV) | Method | Reference | Comment |
---|---|---|---|
8.47 ± 0.03 | PI | Potapov, Kardash, et al., 1972 | LLK |

Normal alkane RI, non-polar column, custom temperature program

Column type | Active phase | I | Reference | Comment |
---|---|---|---|---|
Capillary | Methyl Silicone | 1673. | Oda, Yasuhara, et al., 1998 | 25. m/0.25 mm/0.25 μm, He; Program: 50 0C (2 min) 20 0C/min -> 160 0C 5 0C/min -> 210 0C 10 0C/min -> 300 0C |

References

Aldrich Chemical Company Inc., 1990
Aldrich Chemical Company Inc.,
Catalog Handbook of Fine Chemicals, Aldrich Chemical Company, Inc., Milwaukee WI, 1990, 1. [all data]
Potapov, Kardash, et al., 1972
Potapov, V.K.; Kardash, I.E.; Sorokin, V.V.; Sokolov, S.A.; Evlasheva, T.I.,
Photoionization of heteroaromatic compounds,
Khim. Vys. Energ., 1972, 6, 392. [all data]
Oda, Yasuhara, et al., 1998
Oda, J.; Yasuhara, A.; Matsunaga, K.; Saito, Y.,
Identification of polycyclic aromatic hydrocarbons of the particulate accumulated in the tunnel duct of freeway and generation of their oxygenated derivatives,
Jpn. J. Toxicol. Environ. Health, 1998, 44, 5, 334-351, https://doi.org/10.1248/jhs1956.44.334
. [all data]