3-Methylene-1,4-cyclohexadiene
- Formula: C7H8
- Molecular weight: 92.1384
- IUPAC Standard InChIKey: LVRLCNCYLXWRNI-UHFFFAOYSA-N
- CAS Registry Number: 3217-87-6
- Chemical structure:
View 3d structure (requires JavaScript / HTML 5) - Permanent link for this species. Use this link for bookmarking this species for future reference.

Gas phase thermochemistry data

Data compiled by: Hussein Y. Afeefy, Joel F. Liebman, and Stephen E. Stein
Quantity | Value | Units | Method | Reference | Comment |
---|---|---|---|---|---|
ΔfH°gas | 150. ± 10. | kJ/mol | Ion | Bartmess, 1982 | Bracketing with RS- |

Gas phase ion energetics data

Data compiled as indicated in comments:
LBLHLM - Sharon G. Lias, John E. Bartmess, Joel F. Liebman, John L. Holmes, Rhoda D. Levin, and W. Gary Mallard
Ionization energy determinations
IE (eV) | Method | Reference | Comment |
---|---|---|---|
8.6 ± 0.1 | EI | Bartmess, 1982, 2 | LBLHLM |

References

Bartmess, 1982
Bartmess, J.E.,
Gas-phase ion chemistry of 5-methylene-1,3-cyclohexadiene (o-isotoluene) and 3-methylene-1,4-cyclohexadiene (p-isotoluene),
J. Am. Chem. Soc., 1982, 104, 335-337. [all data]
Bartmess, 1982, 2
Bartmess, J.E.,
Gas phase ion chemistry of 5-methylene-1,3-cyclohexadiene (o-Isotoluene) and 3-Methylene-1,4-cyclohexadiene (p-Isotoluene),
J. Am. Chem. Soc., 1982, 104, 335. [all data]