1,1'-Biphenyl, 2-fluoro-
- Formula: C12H9F
- Molecular weight: 172.1983
- IUPAC Standard InChIKey: KLECYOQFQXJYBC-UHFFFAOYSA-N
- CAS Registry Number: 321-60-8
- Chemical structure:
View 3d structure (requires JavaScript / HTML 5) - Other names: 2-Fluoro-1,1'-biphenyl; 2-Fluorobiphenyl; o-Fluorobiphenyl; 2-Fluorodiphenyl; o-Fluorodiphenyl; Biphenyl, 2-fluoro-

Phase change data

Data compiled by: Robert L. Brown and Stephen E. Stein
Quantity | Value | Units | Method | Reference | Comment |
---|---|---|---|---|---|
Tboil | 521. | K | N/A | PCR Inc., 1990 | |
Tboil | 521.2 | K | N/A | Weast and Grasselli, 1989 |

Gas phase ion energetics data

Data compiled as indicated in comments:
LLK - Sharon G. Lias, Rhoda D. Levin, and Sherif A. Kafafi
Ionization energy determinations
IE (eV) | Method | Reference | Comment |
---|---|---|---|
8.20 ± 0.02 | PE | Maier and Turner, 1972 | LLK |

Normal alkane RI, non-polar column, temperature ramp

Column type | Active phase | I | Reference | Comment |
---|---|---|---|---|
Capillary | PB-1 | 1346. | Andersson and Weis, 1994 | 50. m/0.32 mm/0.2 μm, H2, 80. C @ 2. min, 4. K/min, 270. C @ 5. min |
Capillary | DB-5 | 1346. | Andersson and Weis, 1994 | 30. m/0.32 mm/0.25 μm, H2, 80. C @ 2. min, 4. K/min, 270. C @ 5. min |

Lee's RI, non-polar column, temperature ramp

Column type | Active phase | I | Reference | Comment |
---|---|---|---|---|
Capillary | PB-1 | 232.03 | Andersson and Weis, 1994 | 50. m/0.32 mm/0.2 μm, H2, 80. C @ 2. min, 4. K/min, 270. C @ 5. min |
Capillary | DB-5 | 231.69 | Andersson and Weis, 1994 | 30. m/0.32 mm/0.25 μm, H2, 80. C @ 2. min, 4. K/min, 270. C @ 5. min |
Capillary | DB-5 | 233.5 | Donnelly, Abdel-Hamid, et al., 1993 | 30. m/0.32 mm/0.25 μm, He, 40. C @ 3. min, 8. K/min, 285. C @ 29.5 min |
Lee's RI, polar column, temperature ramp
Column type | Active phase | I | Reference | Comment |
---|---|---|---|---|
Capillary | DB-Wax | 226.44 | Andersson and Weis, 1994 | 30. m/0.2 mm/0.15 μm, H2, 80. C @ 2. min, 4. K/min, 270. C @ 5. min |

References

PCR Inc., 1990
PCR Inc.,
Research Chemicals Catalog 1990-1991, PCR Inc., Gainesville, FL, 1990, 1. [all data]
Weast and Grasselli, 1989
CRC Handbook of Data on Organic Compounds, 2nd Editon, Weast,R.C and Grasselli, J.G., ed(s)., CRC Press, Inc., Boca Raton, FL, 1989, 1. [all data]
Maier and Turner, 1972
Maier, J.P.; Turner, D.W.,
Steric inhibition of resonance studied by molecular photoelectron spectroscopy. Part I. Biphenyls,
Faraday Discuss. Chem. Soc., 1972, 54, 149. [all data]
Andersson and Weis, 1994
Andersson, J.T.; Weis, U.,
Gas Chromatographic Determination of Polycyclic Aromatic Compounds with Fluorinated Analogues as Internal Standards,
J. Chromatogr. A, 1994, 659, 1, 151-161, https://doi.org/10.1016/0021-9673(94)85017-8
. [all data]
Donnelly, Abdel-Hamid, et al., 1993
Donnelly, J.R.; Abdel-Hamid, M.S.; Jeter, J.L.; Gurka, D.F.,
Application of gas chromatographic retention properties to the identification of environmental contaminants,
J. Chromatogr., 1993, 642, 1-2, 409-415, https://doi.org/10.1016/0021-9673(93)80106-I
. [all data]